program: Gaussian 09
title: 000030205
version: EM64L-G09RevD.01
frameworkgroup: C1[X(C9H8Cl2O5)]
method: RPBEPBE
basis: SDD
operation: Freq
keyword: #p
keyword: freq=noraman
keyword: PBEPBE/SDD
title: #p freq=noraman PBEPBE/SDD
converged: YES YES NO NO
title: Mulliken charges:
elementType: Cl Cl O O O O O C C C C C C C C C H H H H H H H H
charge: 0.035622 0.007197 -0.326930 -0.261018 -0.423563 -0.392447 -0.193292 0.385684 0.363932 0.734630 0.042537 -0.661716 -0.554213 0.044476 -0.510124 -0.515428 0.387945 0.250688 0.242330 0.229731 0.267123 0.221472 0.238920 0.386445
chargesum: 0.00000
title: Mulliken charges with hydrogens summed into heavy atoms:
elementType: Cl Cl O O O O O C C C C C C C C C
charge: 0.035622 0.007197 -0.326930 -0.261018 -0.035618 -0.006002 -0.193292 0.385684 0.363932 0.734630 0.042537 -0.661716 -0.554213 0.044476 0.212624 0.212088
polarizability: 1.76248836e+02 -2.32738033e+00 1.69479859e+02 -1.61311580e-01 2.01238242e+00 7.46079011e+01
1716.lowfreq: -2.2268 0.0020 0.0023 0.0030 3.2919 9.6708 32.5367 53.0836 57.7611
frequency: 32.5344 53.0509 57.7450 67.5035 81.0620 104.1308 134.1074 145.3076 150.4656 165.2242 189.3255 204.2802 214.1292 257.7104 286.8582 300.8004 313.5652 332.7090 368.0408 415.3667 428.7757 443.8290 499.9306 533.7412 596.2120 612.0551 641.5301 655.3102 683.7320 721.5468 758.8131 801.8844 807.6234 864.5211 926.2475 965.9298 1043.1438 1075.5931 1111.0473 1113.3891 1150.5040 1152.0994 1176.2830 1242.7763 1255.6205 1329.0021 1380.9480 1382.3647 1423.7519 1438.8902 1449.3604 1454.9115 1460.7500 1475.8986 1477.8021 1578.1634 1584.8319 1656.1530 2989.1679 2990.6933 3098.5964 3101.7713 3136.7708 3141.6890 3421.0444 3502.7268
redmass: 9.6865 3.5488 2.6398 5.2313 2.8281 1.9369 3.4418 5.7027 2.8222 1.5637 18.8676 6.4428 5.8720 6.1537 6.5212 14.2762 6.1306 8.3899 10.9893 7.3840 7.6002 8.4829 7.9304 2.6975 4.1936 1.1317 1.7662 8.1919 8.8133 9.2116 8.4448 10.7106 8.5371 8.2057 11.4611 11.0877 5.7941 2.8990 1.2370 1.2321 1.3620 1.5168 4.3162 1.8163 2.4726 5.5756 4.8564 5.8276 2.0241 1.2854 1.8334 1.0523 1.1711 1.0533 1.0553 7.0141 10.7854 9.9206 1.0316 1.0327 1.1026 1.1002 1.1043 1.1052 1.0633 1.0638
irintensity: 1.7534 5.4439 4.7787 1.6246 1.1672 1.6395 0.6347 0.1800 0.5633 1.0925 0.1420 4.2951 7.6430 2.9793 3.8683 0.3966 7.9736 12.7747 3.2220 2.8290 1.9067 1.4805 1.4602 15.1302 76.5526 126.6413 101.9873 25.7340 10.4578 56.3915 16.9725 8.9646 11.9950 52.1971 76.6950 67.6291 173.5283 199.6544 6.8155 5.1837 2.1594 13.6299 10.0124 313.3282 0.4765 215.7956 183.2290 5.1703 31.0342 46.7889 65.4696 11.0392 3.8724 22.3557 15.8720 2.5254 49.4800 258.7988 66.5391 59.9700 21.8588 27.7657 13.2625 11.1054 97.0617 31.4368
temp: 298.150 k
press: 1.00000 atm
elementType: 17 17 8 8 8 8 8 6 6 6 6 6 6 6 6 6 1 1 1 1 1 1 1 1
symmnumber: 1
zpe: 416368.3 jmol-1
zpe.correction: 0.158586 hartree
zpe.thermalcorrener: 0.175694 hartree
zpe.thermalcorrenthalpy: 0.176639 hartree
zpe.thermalcorrgfe: 0.112314 hartree
zpe.sumelectzpe: -1642.753850 hartree
zpe.sumelectthermal: -1642.736742 hartree
zpe.sumelectthermalent: -1642.735798 hartree
zpe.sumelectthermalfe: -1642.800122 hartree
dipole: -0.6079 4.2679 1.2413
dipole: 4.4862
quadrupole: -95.3026 -96.0092 -109.4222
quadrupole: 2.8326 -10.1238 -1.5777
quadrupole: 4.9421 4.2355 -9.1775 2.8326 -10.1238 -1.5777
hfenergy: -1642.9124368 hartree
pointgroup: C01 [X(C9H8Cl2O5)]
dipole: -1.3344225 1.0798878 -0.410313 debye
dipolederiv: -0.1948934 0.2917896 0.0521158 0.2425987 -0.5168948 -0.0659397 0.0579222 -0.0747881 -0.0177741 -0.2067467 -0.219747 -0.0357642 -0.1920278 -0.6069896 -0.0610566 -0.0528718 -0.0690392 -0.0231592 -0.541298 0.3020099 -0.0895229 0.4882458 -1.1924076 0.1818787 -0.0051992 0.0624552 -0.3683845 -0.8191778 -0.7282059 0.1316756 -0.6537675 -1.082377 0.2156689 0.0237368 -0.0410224 -0.3281305 -1.3793235 0.0834726 0.0753564 0.0762546 -0.2740651 0.0482083 0.0526993 0.0490521 -0.3578575 -0.5105243 -0.1450128 0.3545291 -0.1520116 -0.4818919 0.2728566 0.3817947 0.2582388 -0.9458924 -0.9011478 0.097412 -0.2639913 0.049735 -0.3552209 0.1917979 -0.0288891 0.1719451 -0.7040517 0.1851898 -0.3986379 0.0864179 -0.6390017 0.5683793 -0.0227554 -0.0657125 0.0869386 0.0067386 0.1369115 0.5306611 0.0802558 0.9396171 0.8889168 -0.1665138 0.20394 0.1139158 0.0442971 -0.5675041 -0.0022165 0.0617018 -0.0180079 -0.3701364 -0.0038368 0.0348701 -0.0261619 0.0177917 1.1497155 -0.0319623 -0.1070798 -0.1337777 -0.1453836 0.0484185 -0.1638242 -0.0303209 0.03276 0.3558391 -0.4952814 -0.1042137 -0.3062694 0.7095808 0.1449384 -0.1392426 0.2101449 -0.110109 0.28929 0.3057203 0.0182411 0.2014984 0.7541866 0.1514239 0.1065004 0.1372797 -0.0970968 1.6265159 0.0631824 -0.0600296 0.1206841 0.4678452 -0.5381891 -0.2337436 -0.4799392 1.3275072 0.1767248 -0.0035646 0.0567026 -0.2063787 0.626854 -0.1641224 0.1816432 -0.3111863 0.4266006 0.5795844 0.44335 -0.1499481 0.1565936 0.3615871 -0.1166365 -0.2145555 -0.2577131 0.4252853 0.4371049 0.0118351 -0.034262 -0.023093 0.2518647 -0.0464509 -0.0149634 -0.0160759 0.3490905 0.0009128 -0.1513037 0.0460299 -0.0439674 0.0351484 0.0385716 -0.0143043 0.0471953 0.0560742 -0.0167268 0.1469126 0.0266447 0.1108421 -0.0208215 0.0035142 0.0457209 -0.0124073 0.0702296 0.0791192 -0.0203202 -0.0471633 -0.0313902 -0.0130054 -0.0986661 -0.0970471 0.0432669 -0.1141708 -0.0564894 0.0152165 0.0282129 0.1321368 0.100513 0.0020481 0.0285751 0.0532195 0.0621421 -0.0159992 -0.0548119 -0.0846391 -0.0200093 0.0822618 -0.0226227 0.0306051 0.1162484 -0.1587513 0.0759436 -0.0554992 0.0209888 -0.1038837 -0.1280068 -0.0239232 0.0139133 -0.0456557 0.0789193 0.1169794 0.0150014 -0.0622585 0.0053796 0.340063 0.0313881 -0.1315678 0.0144095 0.3279414 unknown
polarizability: 168.9296227|1.7500089|176.3103327|-6.0285263|-3.9705691|75.0966404 unknown
InChI: InChI=1S/C9H8Cl2O5/c1-15-7-4(10)3(9(13)14)5(11)8(16-2)6(7)12/h12-13H,1-2H3
charge 0 multiplicity 1
24 atoms
Cl 1.550836 -2.785719 -0.372899
Cl 1.320126 2.759788 0.283228
O  -1.774363 2.175774 0.365287
O  -1.38127 -2.638721 -0.156176
O  -2.942171 -0.214632 0.217884
O  3.20438 0.649967 -1.328467
O  3.567851 -0.383399 0.719984
C  -0.900036 1.083033 0.167123
C  -0.807258 -1.381301 -0.015143
C  1.274981 -0.021571 -0.084966
C  -1.551221 -0.179738 0.132107
C  0.602687 -1.266661 -0.131128
C  0.501372 1.150715 0.081668
C  2.777181 0.042015 -0.145168
C  -1.866358 3.157812 -0.750325
C  -2.420965 -3.050856 0.818899
H  -3.241402 0.725026 0.38373
H  -0.910351 3.692011 -0.872167
H  -2.655836 3.860389 -0.445417
H  -2.142681 2.645845 -1.690475
H  -3.311994 -2.409301 0.738252
H  -2.012849 -3.01549 1.845925
H  -2.65579 -4.088856 0.542262
H  4.19953 0.705971 -1.327119
