program: Orca
programVersion: 4.2.1
elementType: Cl Cl O O O N N N C C C C C C C C C C C C C C C C C C C H H H H H H H H H H H H H H H H H
charge: 0
multiplicity: 1
keywords: wb97x-d3
keywords: def2-TZVPP
keywords: def2/J RIJCOSX GRIDX6 NOFINALGRIDX
keywords: grid4 nofinalgrid
keywords: scfconv7
keywords: smallprint printgap noloewdin
keywords: NOSOSCF
formula: C19H17Cl2N3O3
InChI: InChI=1S/C19H17Cl2N3O3/c1-13-9-25-19(27-13,10-24-12-22-11-23-24)17-7-6-16(8-18(17)21)26-15-4-2-14(20)3-5-15/h2-8,11-13H,9-10H2,1H3
44 atoms
Cl 1.011653 0.34484 2.045984
Cl -6.952329 -0.516754 0.683143
O  4.119213 0.498292 -1.206097
O  3.678389 0.354983 0.961762
O  -2.049973 1.538032 -1.777296
N  2.384277 -2.255645 0.448474
N  1.1369 -2.529745 0.059585
N  1.476012 -3.231261 2.158478
C  3.211504 -0.037356 -0.285078
C  4.678982 1.690424 -0.647041
C  3.307154 -1.560723 -0.408758
C  4.143417 1.680432 0.792784
C  1.79621 0.459462 -0.586474
C  6.185449 1.632815 -0.748118
C  0.777255 0.613251 0.350939
C  1.460436 0.691612 -1.919103
C  -0.50774 0.982743 -0.017457
C  0.18193 1.033931 -2.317316
C  -0.806957 1.171327 -1.356773
C  2.570293 -2.673484 1.703558
C  0.629943 -3.109737 1.116028
C  -3.16029 1.024829 -1.166809
C  -4.241979 1.87647 -1.000567
C  -3.244974 -0.305796 -0.7752
C  -5.416103 1.400636 -0.438599
C  -4.413961 -0.778178 -0.200913
C  -5.491925 0.077422 -0.034747
H  4.299692 2.559358 -1.192557
H  4.32088 -1.874161 -0.157304
H  3.106976 -1.859827 -1.436684
H  4.911509 1.876894 1.541096
H  3.335528 2.40691 0.929903
H  6.592228 0.801884 -0.168649
H  6.509409 1.522357 -1.78378
H  6.620104 2.557111 -0.365698
H  2.219638 0.58337 -2.681689
H  -1.265467 1.110134 0.74421
H  -0.045132 1.188554 -3.363913
H  3.50556 -2.559967 2.228919
H  -0.387159 -3.469816 1.133345
H  -4.172091 2.91045 -1.312896
H  -2.412923 -0.984914 -0.911797
H  -6.258372 2.066953 -0.311718
H  -4.476711 -1.812911 0.10732
elementType: Cl O N C H
totalener: -2044.69511563 hartree
nucrepener: 2798.32946599 hartree
electener: -4843.02458163 hartree
oneelecener: -8367.99387178 hartree
twoeener: 3524.96929015 hartree
cpcmener: -0.02878759 hartree
kineticenergy: 2038.70859524 hartree
xcener: -149.989777123890 hartree
chargesum: -0.0000000
charge: -0.077570 -0.099849 -0.399497 -0.357932 -0.323187 0.098585 -0.335679 -0.398807 0.593472 0.156544 -0.072508 -0.011175 -0.106346 -0.295869 -0.013989 -0.153458 -0.148302 -0.266207 0.264774 0.058181 0.063072 0.286828 -0.255082 -0.192369 -0.103803 -0.128007 0.062908 0.082694 0.121918 0.129120 0.107576 0.094179 0.088730 0.095668 0.095108 0.143484 0.129751 0.148186 0.169096 0.155360 0.149640 0.153867 0.144994 0.145902
qa: -0.0776 -0.0998 -0.3995 -0.3579 -0.3232 0.0986 -0.3357 -0.3988 0.5935 0.1565 -0.0725 -0.0112 -0.1063 -0.2959 -0.0140 -0.1535 -0.1483 -0.2662 0.2648 0.0582 0.0631 0.2868 -0.2551 -0.1924 -0.1038 -0.1280 0.0629 0.0827 0.1219 0.1291 0.1076 0.0942 0.0887 0.0957 0.0951 0.1435 0.1298 0.1482 0.1691 0.1554 0.1496 0.1539 0.1450 0.1459
va: 1.2411 1.2038 1.9829 2.0038 2.0885 3.3576 2.8515 3.0275 3.8414 3.8392 3.8488 3.9366 3.5747 3.9814 3.9378 3.9818 3.9505 4.0666 3.7969 4.0761 4.0397 3.7034 4.0425 3.9449 3.9481 3.9696 3.8477 1.0023 1.0206 1.0119 0.9978 1.0024 1.0045 1.0051 1.0045 1.0231 1.0237 1.0072 0.9993 0.9976 1.0060 1.0010 1.0019 1.0037
dispcorr: -0.025834161 hartree
energy: -2044.720949795505
dipole: 32.92717 -30.85357 2.07360 6.89356 -5.28469 1.60887 -10.22566 9.05803 -1.16763
magnitude: 2.87257 au
magnitude: 7.30148 debye
