program: Orca
programVersion: 4.2.1
elementType: Cl Cl O O O N N N C C C C C C C C C C C C C C C C C C C H H H H H H H H H H H H H H H H H
charge: 0
multiplicity: 1
keywords: wb97x-d3
keywords: def2-TZVPP
keywords: def2/J RIJCOSX GRIDX6 NOFINALGRIDX
keywords: grid4 nofinalgrid
keywords: scfconv7
keywords: smallprint printgap noloewdin
keywords: NOSOSCF
formula: C19H17Cl2N3O3
InChI: InChI=1S/C19H17Cl2N3O3/c1-13-9-25-19(27-13,10-24-12-22-11-23-24)17-7-6-16(8-18(17)21)26-15-4-2-14(20)3-5-15/h2-8,11-13H,9-10H2,1H3
44 atoms
Cl 1.762301 -0.60906 -2.700378
Cl -7.795316 1.172894 1.269514
O  3.453198 0.01686 -0.329172
O  2.577197 -0.145869 1.719881
O  -2.642763 1.366899 -1.504227
N  3.708384 -2.559406 0.702768
N  4.674381 -2.778687 -0.19063
N  5.427324 -3.153548 1.884086
C  2.386836 -0.517376 0.378465
C  3.828368 1.223208 0.320218
C  2.424068 -2.048377 0.308862
C  3.53168 0.902526 1.781696
C  1.041298 -0.003065 -0.129029
C  5.273937 1.537177 0.029441
C  0.68448 -0.020055 -1.477746
C  0.091997 0.485616 0.763675
C  -0.554998 0.416304 -1.912961
C  -1.150177 0.943241 0.355697
C  -1.472216 0.901048 -0.992484
C  4.172692 -2.778791 1.936034
C  5.682657 -3.136321 0.560128
C  -3.807927 1.296354 -0.792909
C  -4.18219 0.160512 -0.086809
C  -4.656387 2.39106 -0.866359
C  -5.410289 0.127383 0.554589
C  -5.889788 2.353184 -0.236238
C  -6.25689 1.222239 0.475246
H  3.19155 2.047882 -0.025143
H  2.210492 -2.408767 -0.694277
H  1.658989 -2.449278 0.973388
H  4.423241 0.552634 2.311858
H  3.122712 1.758829 2.32124
H  5.578979 2.424953 0.584689
H  5.923814 0.712043 0.325267
H  5.432463 1.741986 -1.029378
H  0.327932 0.520263 1.817822
H  -0.810546 0.388858 -2.964069
H  -1.84373 1.331808 1.089735
H  3.567316 -2.669758 2.821754
H  6.64025 -3.400339 0.138461
H  -3.535255 -0.705829 -0.034671
H  -4.359877 3.270055 -1.423934
H  -5.703195 -0.7571 1.103613
H  -6.552036 3.205717 -0.300476
elementType: Cl O N C H
totalener: -2044.69954054 hartree
nucrepener: 2690.39664462 hartree
electener: -4735.09618517 hartree
oneelecener: -8151.24354444 hartree
twoeener: 3416.14735928 hartree
cpcmener: -0.02983971 hartree
kineticenergy: 2038.70281819 hartree
xcener: -149.988179843971 hartree
chargesum: -0.0000000
charge: -0.078005 -0.099023 -0.349799 -0.406470 -0.321056 0.123821 -0.339201 -0.413525 0.573155 0.144164 -0.106708 0.014021 -0.156544 -0.277410 0.025441 -0.110958 -0.236981 -0.223287 0.277790 0.053461 0.051447 0.301081 -0.209279 -0.258530 -0.122098 -0.101887 0.059556 0.080706 0.135831 0.137537 0.086173 0.105240 0.097638 0.081594 0.097571 0.149616 0.127604 0.156736 0.169694 0.160064 0.158292 0.150275 0.146533 0.145720
qa: -0.0780 -0.0990 -0.3498 -0.4065 -0.3211 0.1238 -0.3392 -0.4135 0.5732 0.1442 -0.1067 0.0140 -0.1565 -0.2774 0.0254 -0.1110 -0.2370 -0.2233 0.2778 0.0535 0.0514 0.3011 -0.2093 -0.2585 -0.1221 -0.1019 0.0596 0.0807 0.1358 0.1375 0.0862 0.1052 0.0976 0.0816 0.0976 0.1496 0.1276 0.1567 0.1697 0.1601 0.1583 0.1503 0.1465 0.1457
va: 1.2418 1.2046 2.0213 1.9647 2.0886 3.3813 2.8923 3.0244 3.8789 3.8704 3.7844 3.9137 3.6481 3.9788 3.9658 3.9279 4.1338 3.9872 3.7941 4.0640 4.0533 3.6865 3.9671 4.0464 3.9611 3.9450 3.8511 1.0020 1.0324 1.0084 1.0005 1.0002 1.0042 1.0068 1.0027 1.0256 1.0285 0.9983 1.0020 0.9957 0.9946 1.0060 1.0031 1.0017
dispcorr: -0.024034285 hartree
energy: -2044.723574829659
dipole: 26.24051 -27.37270 -1.13218 4.69742 -3.15196 1.54546 8.52282 -7.76969 0.75312
magnitude: 2.05851 au
magnitude: 5.23233 debye
