program: Orca
programVersion: 4.2.1
elementType: Cl Cl O O O N N N C C C C C C C C C C C C C C C C C C C H H H H H H H H H H H H H H H H H
charge: 0
multiplicity: 1
keywords: wb97x-d3
keywords: def2-TZVPP
keywords: def2/J RIJCOSX GRIDX6 NOFINALGRIDX
keywords: grid4 nofinalgrid
keywords: scfconv7
keywords: smallprint printgap noloewdin
keywords: NOSOSCF
formula: C19H17Cl2N3O3
InChI: InChI=1S/C19H17Cl2N3O3/c1-13-9-25-19(27-13,10-24-12-22-11-23-24)17-7-6-16(8-18(17)21)26-15-4-2-14(20)3-5-15/h2-8,11-13H,9-10H2,1H3
44 atoms
Cl 0.677712 0.588111 2.475281
Cl -7.163286 2.010096 0.343274
O  3.950627 0.211037 -0.616593
O  3.263593 1.332871 1.199447
O  -2.226359 -0.523378 -1.523917
N  3.09495 -2.297426 0.714417
N  3.819058 -2.812445 -0.280246
N  2.012727 -4.077352 0.109737
C  3.064325 0.158115 0.453943
C  4.164935 1.587139 -0.918661
C  3.435533 -1.045206 1.334692
C  4.114435 2.204174 0.469406
C  1.621171 0.054717 -0.036676
C  5.47022 1.755452 -1.651784
C  0.510614 0.208618 0.790112
C  1.370133 -0.289456 -1.36252
C  -0.786418 0.036227 0.330545
C  0.088203 -0.444569 -1.855455
C  -0.993147 -0.284946 -1.003129
C  2.017114 -3.056806 0.930635
C  3.136293 -3.878862 -0.608128
C  -3.34057 0.100664 -1.036519
C  -4.486062 -0.669681 -0.901657
C  -3.367466 1.460011 -0.753695
C  -5.668896 -0.081236 -0.483891
C  -4.546705 2.046005 -0.322275
C  -5.68967 1.272829 -0.190231
H  3.339562 1.968608 -1.533783
H  2.907416 -0.989242 2.28415
H  4.504632 -1.027034 1.546159
H  5.10708 2.236308 0.932179
H  3.698495 3.212686 0.467059
H  5.445711 1.258655 -2.621896
H  5.660234 2.814113 -1.830728
H  6.305016 1.352951 -1.076331
H  2.201494 -0.438988 -2.036929
H  -1.616069 0.14192 1.016988
H  -0.071909 -0.702006 -2.894206
H  1.283119 -2.833647 1.689794
H  3.462142 -4.544107 -1.39267
H  -4.458584 -1.727149 -1.130962
H  -2.483676 2.074043 -0.8708
H  -6.562471 -0.682413 -0.384976
H  -4.567962 3.104232 -0.100572
elementType: Cl O N C H
totalener: -2044.69811129 hartree
nucrepener: 2751.09905892 hartree
electener: -4795.79717021 hartree
oneelecener: -8273.05073287 hartree
twoeener: 3477.25356266 hartree
cpcmener: -0.03077246 hartree
kineticenergy: 2038.69697907 hartree
xcener: -149.987470757068 hartree
chargesum: -0.0000000
charge: -0.075244 -0.098970 -0.379948 -0.380333 -0.318550 0.126258 -0.346378 -0.401100 0.628517 0.087712 -0.161408 0.065867 -0.137526 -0.270622 -0.056580 -0.091750 -0.153635 -0.278688 0.296299 0.067524 0.059887 0.300346 -0.257973 -0.211174 -0.101772 -0.120010 0.059809 0.083925 0.139703 0.123871 0.074615 0.092671 0.099066 0.096442 0.081904 0.148825 0.134733 0.147960 0.165118 0.160034 0.149977 0.158994 0.145595 0.146010
qa: -0.0752 -0.0990 -0.3799 -0.3803 -0.3186 0.1263 -0.3464 -0.4011 0.6285 0.0877 -0.1614 0.0659 -0.1375 -0.2706 -0.0566 -0.0918 -0.1536 -0.2787 0.2963 0.0675 0.0599 0.3003 -0.2580 -0.2112 -0.1018 -0.1200 0.0598 0.0839 0.1397 0.1239 0.0746 0.0927 0.0991 0.0964 0.0819 0.1488 0.1347 0.1480 0.1651 0.1600 0.1500 0.1590 0.1456 0.1460
va: 1.2477 1.2048 2.0028 2.0047 2.0963 3.3462 2.8894 3.0319 3.7617 3.9284 3.9197 3.9339 3.6438 3.9650 4.0365 3.8092 3.9825 4.1036 3.7753 4.0615 4.0525 3.6885 4.0492 3.9668 3.9436 3.9573 3.8538 0.9949 1.0137 1.0258 0.9973 0.9945 1.0015 1.0029 1.0109 1.0243 1.0217 1.0082 0.9976 0.9962 1.0061 0.9939 1.0018 1.0033
dispcorr: -0.024856744 hartree
energy: -2044.722968030849
dipole: 31.46845 -30.73693 0.73152 1.41846 0.31717 1.73563 -11.32705 11.07696 -0.25009
magnitude: 1.90002 au
magnitude: 4.82946 debye
