program: Orca
programVersion: 4.2.1
elementType: Cl Cl O O O N N N C C C C C C C C C C C C C C C C C C C H H H H H H H H H H H H H H H H H
charge: 0
multiplicity: 1
keywords: wb97x-d3
keywords: def2-TZVPP
keywords: def2/J RIJCOSX GRIDX6 NOFINALGRIDX
keywords: grid4 nofinalgrid
keywords: scfconv7
keywords: smallprint printgap noloewdin
keywords: NOSOSCF
formula: C19H17Cl2N3O3
InChI: InChI=1S/C19H17Cl2N3O3/c1-13-9-25-19(27-13,10-24-12-22-11-23-24)17-7-6-16(8-18(17)21)26-15-4-2-14(20)3-5-15/h2-8,11-13H,9-10H2,1H3
44 atoms
Cl 2.070334 0.806218 3.104938
Cl -6.639792 1.21152 -2.819002
O  3.341685 0.098478 -1.171717
O  3.792029 1.21184 0.698978
O  -2.499571 0.26258 1.21128
N  2.91389 -2.315852 0.627364
N  2.808087 -2.896669 -0.568272
N  1.446332 -3.887723 0.907751
C  3.101787 0.106848 0.204426
C  3.628742 1.431349 -1.603237
C  3.724147 -1.146546 0.835197
C  3.668867 2.218543 -0.287288
C  1.600507 0.189648 0.479851
C  4.931704 1.440352 -2.370163
C  1.061634 0.487541 1.730482
C  0.695384 -0.105409 -0.535231
C  -0.304489 0.530051 1.95142
C  -0.674978 -0.084976 -0.34248
C  -1.174025 0.245228 0.908754
C  2.089974 -2.909543 1.494961
C  1.922114 -3.835101 -0.351924
C  -3.427833 0.490266 0.230924
C  -3.340674 1.590049 -0.612332
C  -4.501259 -0.381873 0.145365
C  -4.330419 1.809477 -1.556014
C  -5.499531 -0.155764 -0.78985
C  -5.402999 0.934368 -1.639308
H  2.816977 1.789727 -2.243255
H  3.83455 -1.005889 1.908647
H  4.716311 -1.311967 0.415194
H  4.52773 2.885871 -0.210867
H  2.758825 2.809066 -0.138753
H  5.129244 2.439588 -2.760012
H  5.770808 1.152381 -1.733966
H  4.89398 0.757862 -3.220105
H  1.069387 -0.371094 -1.513508
H  -0.697314 0.773825 2.929859
H  -1.330808 -0.335185 -1.165561
H  2.003162 -2.605686 2.526792
H  1.608275 -4.512068 -1.131413
H  -2.511231 2.282122 -0.540529
H  -4.564708 -1.233531 0.810236
H  -4.262528 2.664118 -2.215173
H  -6.339336 -0.834022 -0.854823
elementType: Cl O N C H
totalener: -2044.69772911 hartree
nucrepener: 2759.89920567 hartree
electener: -4804.59693478 hartree
oneelecener: -8290.66442624 hartree
twoeener: 3486.06749145 hartree
cpcmener: -0.03040802 hartree
kineticenergy: 2038.70314526 hartree
xcener: -149.987633356278 hartree
chargesum: 0.0000000
charge: -0.076503 -0.097679 -0.392258 -0.356355 -0.321074 0.127842 -0.347810 -0.400380 0.614454 0.138478 -0.142502 0.017535 -0.175432 -0.296146 -0.002400 -0.134398 -0.204036 -0.209396 0.278689 0.073469 0.059544 0.275943 -0.195203 -0.238590 -0.124288 -0.109443 0.067767 0.081324 0.138107 0.123652 0.106723 0.089497 0.094774 0.087824 0.095770 0.147624 0.128005 0.153420 0.163882 0.160215 0.157514 0.150382 0.146192 0.145266
qa: -0.0765 -0.0977 -0.3923 -0.3564 -0.3211 0.1278 -0.3478 -0.4004 0.6145 0.1385 -0.1425 0.0175 -0.1754 -0.2961 -0.0024 -0.1344 -0.2040 -0.2094 0.2787 0.0735 0.0595 0.2759 -0.1952 -0.2386 -0.1243 -0.1094 0.0678 0.0813 0.1381 0.1237 0.1067 0.0895 0.0948 0.0878 0.0958 0.1476 0.1280 0.1534 0.1639 0.1602 0.1575 0.1504 0.1462 0.1453
va: 1.2437 1.2059 1.9828 2.0143 2.0892 3.3465 2.8852 3.0344 3.7991 3.8605 3.8915 3.9318 3.6278 3.9809 3.9687 3.9027 4.1054 3.9946 3.7921 4.0531 4.0523 3.7032 3.9698 4.0429 3.9586 3.9473 3.8473 0.9989 1.0092 1.0257 0.9941 1.0016 1.0046 1.0054 1.0047 1.0297 1.0265 0.9993 1.0000 0.9960 0.9950 1.0047 1.0031 1.0021
dispcorr: -0.025304877 hartree
energy: -2044.723033990836
dipole: 24.28901 -23.67107 0.61793 1.98748 -0.20956 1.77792 -8.97218 8.71089 -0.26129
magnitude: 1.90029 au
magnitude: 4.83016 debye
