program: Orca
programVersion: 4.2.1
elementType: Cl Cl O O O N N N C C C C C C C C C C C C C C C C C C C H H H H H H H H H H H H H H H H H
charge: 0
multiplicity: 1
keywords: wb97x-d3
keywords: def2-TZVPP
keywords: def2/J RIJCOSX GRIDX6 NOFINALGRIDX
keywords: grid4 nofinalgrid
keywords: scfconv7
keywords: smallprint printgap noloewdin
keywords: NOSOSCF
formula: C19H17Cl2N3O3
InChI: InChI=1S/C19H17Cl2N3O3/c1-13-9-25-19(27-13,10-24-12-22-11-23-24)17-7-6-16(8-18(17)21)26-15-4-2-14(20)3-5-15/h2-8,11-13H,9-10H2,1H3
44 atoms
Cl 2.568047 0.677874 -2.661235
Cl -7.024945 1.328951 1.645839
O  3.853415 1.086862 -0.040238
O  3.062541 0.067599 1.78299
O  -2.274874 0.238207 -1.600151
N  2.849613 -2.421734 0.075656
N  2.561827 -2.943199 1.269203
N  1.389809 -3.971339 -0.339265
C  3.054215 0.02216 0.39031
C  4.0578 2.005241 1.034558
C  3.718914 -1.284767 -0.067529
C  3.170031 1.435376 2.137816
C  1.628775 0.130519 -0.149385
C  5.527146 2.064794 1.390224
C  1.325619 0.410548 -1.480334
C  0.553225 -0.141124 0.691414
C  0.021109 0.465936 -1.942022
C  -0.760553 -0.108273 0.257103
C  -1.023941 0.209452 -1.067237
C  2.137393 -3.036582 -0.871822
C  1.68739 -3.869637 0.97117
C  -3.354697 0.499427 -0.800139
C  -3.397347 1.621592 0.016794
C  -4.437792 -0.360995 -0.875343
C  -4.528832 1.874724 0.774205
C  -5.576685 -0.101288 -0.127893
C  -5.610458 1.010279 0.697758
H  3.708341 2.992736 0.72245
H  4.630619 -1.452411 0.50628
H  3.994181 -1.20718 -1.11767
H  3.613121 1.501891 3.131477
H  2.188573 1.921311 2.162795
H  5.888334 1.107455 1.771323
H  6.129779 2.336769 0.522636
H  5.698648 2.820156 2.158266
H  0.741067 -0.398627 1.724397
H  -0.187312 0.697293 -2.978361
H  -1.555041 -0.340968 0.95333
H  2.204406 -2.778973 -1.91772
H  1.24877 -4.501504 1.728069
H  -2.559135 2.30473 0.068926
H  -4.399587 -1.229997 -1.519295
H  -4.561718 2.746611 1.413093
H  -6.423639 -0.770755 -0.189547
elementType: Cl O N C H
totalener: -2044.69706306 hartree
nucrepener: 2755.80853612 hartree
electener: -4800.50559917 hartree
oneelecener: -8282.51886198 hartree
twoeener: 3482.01326281 hartree
cpcmener: -0.02982968 hartree
kineticenergy: 2038.70200562 hartree
xcener: -149.987026154365 hartree
chargesum: 0.0000000
charge: -0.077821 -0.098368 -0.378390 -0.366723 -0.321849 0.126011 -0.345428 -0.400661 0.611150 0.189849 -0.145912 -0.028709 -0.128136 -0.299538 -0.034002 -0.146635 -0.200536 -0.195605 0.268351 0.070670 0.060152 0.271265 -0.193167 -0.236117 -0.125943 -0.110822 0.069106 0.077497 0.119277 0.136093 0.105318 0.098349 0.089708 0.093011 0.094538 0.147352 0.126642 0.153914 0.164404 0.159928 0.158464 0.151004 0.146706 0.145604
qa: -0.0778 -0.0984 -0.3784 -0.3667 -0.3218 0.1260 -0.3454 -0.4007 0.6111 0.1898 -0.1459 -0.0287 -0.1281 -0.2995 -0.0340 -0.1466 -0.2005 -0.1956 0.2684 0.0707 0.0602 0.2713 -0.1932 -0.2361 -0.1259 -0.1108 0.0691 0.0775 0.1193 0.1361 0.1053 0.0983 0.0897 0.0930 0.0945 0.1474 0.1266 0.1539 0.1644 0.1599 0.1585 0.1510 0.1467 0.1456
va: 1.2405 1.2051 2.0123 1.9969 2.0875 3.3500 2.8851 3.0328 3.8006 3.8613 3.9049 3.9774 3.6545 3.9649 4.0042 3.8768 4.1100 3.9809 3.8042 4.0561 4.0505 3.7071 3.9693 4.0410 3.9596 3.9480 3.8459 0.9993 1.0276 1.0118 0.9976 0.9953 1.0043 1.0069 1.0058 1.0298 1.0274 0.9987 0.9989 0.9963 0.9946 1.0045 1.0032 1.0020
dispcorr: -0.025208607 hartree
energy: -2044.722271664319
dipole: 24.85087 -24.07285 0.77802 2.58181 -0.86862 1.71320 9.90166 -9.55556 0.34609
magnitude: 1.91315 au
magnitude: 4.86284 debye
