program: Gaussian 09
title: 000030184
version: EM64L-G09RevD.01
frameworkgroup: C1[X(C11H15N3S)]
method: RPBEPBE
basis: SDD
operation: Freq
keyword: #p
keyword: freq=noraman
keyword: PBEPBE/SDD
title: #p freq=noraman PBEPBE/SDD
converged: YES YES NO NO
title: Mulliken charges:
elementType: S N N N C C C C C C C C C C C H H H H H H H H H H H H H H H
charge: 0.216362 -0.091961 -0.414738 -0.050851 -0.299988 -0.639343 0.279875 0.027783 -0.193583 -0.626741 -0.619004 -0.358287 -0.343944 -0.215838 -0.228609 0.214656 0.236691 0.299795 0.261549 0.315511 0.252300 0.192436 0.221054 0.224222 0.190882 0.225062 0.233025 0.243306 0.223965 0.224412
chargesum: 0.00000
title: Mulliken charges with hydrogens summed into heavy atoms:
elementType: S N N N C C C C C C C C C C C
charge: 0.216362 -0.091961 -0.099227 -0.050851 0.151360 -0.077999 0.279875 0.027783 -0.193583 0.039049 0.021162 -0.125262 -0.100638 0.008127 -0.004197
polarizability: 2.29825195e+02 1.88542770e+01 1.67530006e+02 -1.20736382e+01 9.19872676e+00 8.85832262e+01
1716.lowfreq: -15.4829 -5.4936 0.0003 0.0019 0.0023 3.4695 22.1936 28.4598 30.8902
frequency: 22.0456 27.6850 30.6898 81.4090 108.0931 131.0562 169.9217 203.8595 227.5166 243.9694 246.9066 298.2212 310.0168 336.4880 382.0935 407.1161 426.2677 429.4104 491.3732 565.6930 578.2440 582.2953 612.7686 650.4070 657.6762 741.6412 750.1146 764.8294 794.3623 813.3539 854.0407 876.5559 931.1167 931.4962 972.7543 1005.7165 1008.1042 1025.4667 1046.0226 1060.3637 1089.5251 1106.6339 1123.8704 1144.8949 1152.5792 1162.7156 1207.4063 1230.9281 1259.6553 1269.5866 1274.9188 1277.5544 1311.1911 1338.4187 1359.6030 1411.8899 1413.2241 1421.8325 1427.0719 1443.6378 1458.6942 1460.2613 1469.8171 1472.5633 1477.3140 1479.6271 1489.7314 1595.2407 1631.0009 2854.7501 2870.0945 2923.3606 3014.7438 3023.9532 3044.2134 3053.0556 3074.4718 3090.2490 3130.9981 3136.1729 3143.1886 3158.2742 3171.4645 3597.9699
redmass: 4.4794 2.8817 3.6290 2.6754 5.4341 3.0340 2.7641 1.2519 1.4159 1.8880 4.3129 5.7976 4.8062 2.9507 8.3902 2.2833 2.9644 2.7322 5.0815 1.2237 3.8718 7.7088 6.7082 5.5345 5.7231 1.2686 1.3557 3.5285 5.1376 4.1376 1.4757 6.4773 1.4081 7.8445 1.3027 1.6211 2.0264 2.4201 1.5498 3.2305 1.2507 1.7014 1.3344 1.4909 1.7284 1.2292 2.8422 1.4156 3.1161 1.4059 2.3798 2.0592 1.3306 3.0290 1.3097 2.0410 2.8341 1.3434 1.2331 1.1432 1.5913 1.6936 1.1166 1.0829 2.3211 1.1233 1.0558 6.8619 7.4848 1.0566 1.0561 1.0682 1.0731 1.0748 1.0927 1.0580 1.1004 1.1006 1.0852 1.1081 1.0903 1.0957 1.0995 1.0814
irintensity: 2.7000 0.5934 1.4700 1.9620 1.3024 2.4617 1.0926 2.8111 1.2029 0.6196 6.2998 1.0162 3.9861 12.1596 10.8891 2.0643 10.2087 1.6608 1.1257 88.9597 0.3713 3.4898 1.9943 15.6554 53.0379 15.4338 107.0702 9.2124 1.6921 14.9513 0.0644 3.1754 4.3047 5.6859 0.0284 7.8894 8.1342 17.3965 26.9672 38.5151 6.5764 3.0220 14.7619 4.3963 15.0095 15.0389 12.9837 2.1090 61.8922 16.2267 13.8142 10.5234 7.2010 73.1728 4.8354 160.5496 3.1597 85.8571 31.9549 7.6045 13.6333 2.2348 5.2752 34.3201 10.4586 35.9041 7.5826 1.7053 2.9655 114.5737 136.7919 59.6780 49.8190 52.4201 20.1666 19.7361 33.7374 25.3219 0.1477 4.0736 12.2011 27.5029 19.8754 51.4442
temp: 298.150 k
press: 1.00000 atm
elementType: 16 7 7 7 6 6 6 6 6 6 6 6 6 6 6 1 1 1 1 1 1 1 1 1 1 1 1 1 1 1
symmnumber: 1
zpe: 640274.3 jmol-1
zpe.correction: 0.243868 hartree
zpe.thermalcorrener: 0.258946 hartree
zpe.thermalcorrenthalpy: 0.259890 hartree
zpe.thermalcorrgfe: 0.199358 hartree
zpe.sumelectzpe: -989.352498 hartree
zpe.sumelectthermal: -989.337420 hartree
zpe.sumelectthermalent: -989.336475 hartree
zpe.sumelectthermalfe: -989.397008 hartree
dipole: -0.4657 0.9591 1.4682
dipole: 1.8145
quadrupole: -84.7924 -88.6710 -101.3053
quadrupole: -5.0970 -0.3855 3.1747
quadrupole: 6.7972 2.9185 -9.7157 -5.0970 -0.3855 3.1747
hfenergy: -989.5963654 hartree
pointgroup: C01 [X(C11H15N3S1)]
dipole: -0.1730762 0.6020061 0.3424604 debye
polarizability: 226.5275801|10.4340821|157.9998979|-27.0442983|-28.8204454|101.4109494 unknown
InChI: InChI=1S/C11H15N3S/c1-14(2)7-8-15-11-12-9-5-3-4-6-10(9)13-11/h3-6,12H,7-8H2,1-2H3
charge 0 multiplicity 1
30 atoms
S  1.28593 2.146852 -1.415502
N  4.161337 -0.500686 0.057134
N  -1.325802 1.760558 -0.509878
N  -0.034509 -0.12219 -0.395421
C  3.282658 0.690026 0.040015
C  2.636405 0.807182 -1.354053
C  -2.168172 0.757617 0.006157
C  -1.340317 -0.415842 0.072072
C  -0.071459 1.175809 -0.729859
C  3.440984 -1.748609 0.387164
C  5.40432 -0.33934 0.832562
C  -3.517686 0.75708 0.407807
C  -1.877064 -1.628865 0.556372
C  -4.035906 -0.466887 0.889046
C  -3.229424 -1.638672 0.961873
H  3.886923 1.592829 0.243371
H  2.48497 0.640133 0.815955
H  2.140057 -0.13043 -1.645903
H  3.369384 1.100217 -2.122036
H  -1.572638 2.731358 -0.693421
H  2.497364 -1.802642 -0.181297
H  3.181567 -1.820507 1.473145
H  4.063359 -2.622612 0.1219
H  6.058219 -1.215313 0.666555
H  5.236282 -0.245956 1.935701
H  5.949156 0.55845 0.490426
H  -4.14458 1.653311 0.354641
H  -1.255133 -2.527599 0.610016
H  -5.081362 -0.514894 1.212833
H  -3.671361 -2.566678 1.340725
