program: Orca
programVersion: 4.2.1
elementType: Cl Cl O O O N N N C C C C C C C C C C C C C C C C C C C H H H H H H H H H H H H H H H H H
charge: 0
multiplicity: 1
keywords: wb97x-d3
keywords: def2-TZVPP
keywords: def2/J RIJCOSX GRIDX6 NOFINALGRIDX
keywords: grid4 nofinalgrid
keywords: scfconv7
keywords: smallprint printgap noloewdin
keywords: NOSOSCF
formula: C19H17Cl2N3O3
InChI: InChI=1S/C19H17Cl2N3O3/c1-13-9-25-19(27-13,10-24-12-22-11-23-24)17-7-6-16(8-18(17)21)26-15-4-2-14(20)3-5-15/h2-8,11-13H,9-10H2,1H3
44 atoms
Cl 0.036596 -2.020794 0.482879
Cl -7.579845 0.335944 -1.787185
O  2.665841 -1.199282 -0.583023
O  3.530658 0.784765 -0.04374
O  -2.539698 2.341208 0.415607
N  4.213392 -1.296205 1.778533
N  4.320951 -2.619108 1.642898
N  6.347679 -1.682444 1.805445
C  2.573839 -0.156004 0.33848
C  3.373895 -0.762904 -1.742207
C  2.935797 -0.63803 1.74689
C  3.617561 0.717541 -1.455899
C  1.175262 0.460532 0.347701
C  4.643554 -1.566832 -1.919707
C  0.002521 -0.290389 0.395863
C  1.03255 1.845924 0.338713
C  -1.253315 0.298711 0.408657
C  -0.205378 2.4608 0.334414
C  -1.351951 1.681752 0.363821
C  5.428989 -0.749315 1.868406
C  5.614691 -2.806352 1.668767
C  -3.680616 1.806573 -0.114521
C  -3.705186 1.183304 -1.355338
C  -4.850777 1.980105 0.609678
C  -4.90878 0.724224 -1.866511
C  -6.056057 1.533511 0.092668
C  -6.076345 0.902744 -1.140987
H  2.729235 -0.889708 -2.616048
H  2.190395 -1.333039 2.125754
H  2.957653 0.218743 2.420455
H  4.604841 1.063933 -1.760939
H  2.864253 1.355253 -1.930788
H  5.356017 -1.383357 -1.113495
H  4.433388 -2.636002 -1.954788
H  5.124858 -1.293684 -2.859963
H  1.915583 2.469719 0.324662
H  -2.136294 -0.32438 0.462994
H  -0.28201 3.539974 0.314181
H  5.592026 0.309844 1.989005
H  6.049315 -3.790853 1.589111
H  -2.801269 1.055746 -1.937057
H  -4.824274 2.472808 1.573061
H  -4.928836 0.238571 -2.832618
H  -6.967986 1.675472 0.656414
elementType: Cl O N C H
totalener: -2044.69868210 hartree
nucrepener: 2708.57366794 hartree
electener: -4753.27235003 hartree
oneelecener: -8187.71286371 hartree
twoeener: 3434.44051367 hartree
cpcmener: -0.03022884 hartree
kineticenergy: 2038.69527397 hartree
xcener: -149.987206999496 hartree
chargesum: -0.0000000
charge: -0.076442 -0.098749 -0.362860 -0.383590 -0.319062 0.125713 -0.335422 -0.409887 0.585919 0.181055 -0.120408 -0.028377 -0.136762 -0.292322 -0.018450 -0.113847 -0.184679 -0.267699 0.288547 0.053000 0.051216 0.299872 -0.209261 -0.260523 -0.120679 -0.100199 0.058063 0.075362 0.136097 0.139588 0.105647 0.102408 0.076724 0.094812 0.103794 0.153208 0.133445 0.147201 0.167883 0.158413 0.158842 0.150257 0.146668 0.145482
qa: -0.0764 -0.0987 -0.3629 -0.3836 -0.3191 0.1257 -0.3354 -0.4099 0.5859 0.1811 -0.1204 -0.0284 -0.1368 -0.2923 -0.0184 -0.1138 -0.1847 -0.2677 0.2885 0.0530 0.0512 0.2999 -0.2093 -0.2605 -0.1207 -0.1002 0.0581 0.0754 0.1361 0.1396 0.1056 0.1024 0.0767 0.0948 0.1038 0.1532 0.1334 0.1472 0.1679 0.1584 0.1588 0.1503 0.1467 0.1455
va: 1.2455 1.2049 2.0168 1.9867 2.0944 3.3766 2.8866 3.0139 3.8653 3.8755 3.7828 3.9573 3.6196 3.9564 4.0363 3.8808 3.9923 4.0649 3.7798 4.0609 4.0459 3.6879 3.9676 4.0498 3.9590 3.9453 3.8532 0.9993 1.0304 1.0073 1.0010 0.9966 1.0063 1.0088 1.0088 1.0189 1.0231 1.0092 1.0028 0.9978 0.9940 1.0062 1.0033 1.0019
dispcorr: -0.024715068 hartree
energy: -2044.723397168142
dipole: 30.74293 -31.18826 -0.44533 4.86897 -2.78316 2.08581 -3.59506 2.83902 -0.75604
magnitude: 2.26286 au
magnitude: 5.75173 debye
