program: Orca
programVersion: 4.2.1
elementType: Cl Cl O O O N N N C C C C C C C C C C C C C C C C C C C H H H H H H H H H H H H H H H H H
charge: 0
multiplicity: 1
keywords: wb97x-d3
keywords: def2-TZVPP
keywords: def2/J RIJCOSX GRIDX6 NOFINALGRIDX
keywords: grid4 nofinalgrid
keywords: scfconv7
keywords: smallprint printgap noloewdin
keywords: NOSOSCF
formula: C19H17Cl2N3O3
InChI: InChI=1S/C19H17Cl2N3O3/c1-13-9-25-19(27-13,10-24-12-22-11-23-24)17-7-6-16(8-18(17)21)26-15-4-2-14(20)3-5-15/h2-8,11-13H,9-10H2,1H3
44 atoms
Cl 0.962017 0.359036 -2.2791
Cl -6.963501 2.023371 -1.485444
O  3.361788 1.148089 -0.762786
O  3.800916 0.223612 1.229176
O  -2.45297 -0.354958 1.393574
N  3.15199 -2.416596 0.058914
N  3.800656 -2.847544 1.142628
N  2.002267 -4.121857 0.748335
C  3.065001 0.052068 0.057758
C  4.079896 2.131047 -0.013992
C  3.553812 -1.226309 -0.640903
C  3.938251 1.621932 1.414685
C  1.569444 -0.020804 0.36133
C  5.512069 2.220039 -0.496653
C  0.576681 0.110374 -0.605721
C  1.144165 -0.296974 1.658978
C  -0.773364 0.014345 -0.301253
C  -0.192969 -0.390112 1.994451
C  -1.15608 -0.221863 1.010642
C  2.077413 -3.180277 -0.158767
C  3.07908 -3.871257 1.519135
C  -3.463852 0.221526 0.672354
C  -4.551034 -0.572494 0.343123
C  -3.447525 1.570062 0.340894
C  -5.636233 -0.017114 -0.317239
C  -4.525175 2.123043 -0.331339
C  -5.613068 1.326271 -0.654544
H  3.580204 3.094125 -0.142146
H  4.640404 -1.208688 -0.713988
H  3.152909 -1.274761 -1.651126
H  4.81514 1.805915 2.034871
H  3.061833 2.048962 1.914676
H  5.55221 2.430062 -1.565781
H  6.031767 3.02957 0.01717
H  6.060383 1.294586 -0.308979
H  1.879982 -0.438887 2.438016
H  -1.506739 0.114722 -1.089974
H  -0.487973 -0.597623 3.014488
H  1.39902 -3.01974 -0.981961
H  3.343137 -4.467268 2.378977
H  -4.558285 -1.621526 0.609584
H  -2.607171 2.19924 0.605048
H  -6.486915 -0.635903 -0.568088
H  -4.513788 3.172789 -0.590817
elementType: Cl O N C H
totalener: -2044.69702555 hartree
nucrepener: 2753.22065686 hartree
electener: -4797.91768241 hartree
oneelecener: -8277.23990495 hartree
twoeener: 3479.32222254 hartree
cpcmener: -0.02984008 hartree
kineticenergy: 2038.70115802 hartree
xcener: -149.987269200889 hartree
chargesum: 0.0000000
charge: -0.076370 -0.097775 -0.380108 -0.367787 -0.317710 0.121212 -0.342013 -0.400026 0.593049 0.195873 -0.136051 -0.029256 -0.155113 -0.301286 -0.050331 -0.093034 -0.148620 -0.271558 0.295864 0.062295 0.059691 0.275938 -0.242565 -0.199071 -0.107268 -0.123008 0.067121 0.079867 0.117494 0.137721 0.104301 0.098242 0.092713 0.094289 0.090102 0.146521 0.129614 0.148025 0.166016 0.160487 0.150392 0.159592 0.146061 0.146471
qa: -0.0764 -0.0978 -0.3801 -0.3678 -0.3177 0.1212 -0.3420 -0.4000 0.5930 0.1959 -0.1361 -0.0293 -0.1551 -0.3013 -0.0503 -0.0930 -0.1486 -0.2716 0.2959 0.0623 0.0597 0.2759 -0.2426 -0.1991 -0.1073 -0.1230 0.0671 0.0799 0.1175 0.1377 0.1043 0.0982 0.0927 0.0943 0.0901 0.1465 0.1296 0.1480 0.1660 0.1605 0.1504 0.1596 0.1461 0.1465
va: 1.2458 1.2058 2.0120 1.9937 2.0951 3.3518 2.8939 3.0316 3.8388 3.8724 3.8935 3.9872 3.6270 3.9626 4.0307 3.8040 3.9619 4.0908 3.7794 4.0677 4.0522 3.7011 4.0463 3.9716 3.9454 3.9567 3.8498 0.9981 1.0279 1.0136 0.9975 0.9957 1.0077 1.0065 1.0044 1.0261 1.0253 1.0077 0.9965 0.9961 1.0053 0.9936 1.0020 1.0033
dispcorr: -0.025136946 hartree
energy: -2044.722162492494
dipole: 30.00815 -29.45189 0.55626 2.50946 -0.74848 1.76098 10.17855 -10.11874 0.05982
magnitude: 1.84771 au
magnitude: 4.69651 debye
