program: Gaussian 09
title: 000030162
version: EM64L-G09RevD.01
frameworkgroup: C1[X(C12H17NO)]
method: RPBEPBE
basis: SDD
operation: Freq
keyword: #p
keyword: freq=noraman
keyword: PBEPBE/SDD
title: #p freq=noraman PBEPBE/SDD
converged: YES YES NO NO
title: Mulliken charges:
elementType: O N C C C C C C C C C C C C H H H H H H H H H H H H H H H H H
charge: -0.285936 -0.292232 -0.021390 -0.557120 -0.446952 0.231850 0.196132 -0.058716 -0.390090 -0.367504 -0.684244 -0.700905 -0.249107 -0.202855 0.246633 0.243788 0.223709 0.234334 0.203886 0.245154 0.209393 0.236684 0.247318 0.199919 0.231234 0.214843 0.238331 0.209054 0.196258 0.223388 0.225143
chargesum: 0.00000
title: Mulliken charges with hydrogens summed into heavy atoms:
elementType: O N C C C C C C C C C C C C
charge: -0.285936 -0.047077 0.225243 -0.089622 -0.008733 0.231850 0.196132 0.150677 -0.153406 -0.120186 -0.038248 -0.057263 -0.025719 0.022288
polarizability: 1.93202483e+02 1.84078714e+00 1.29755229e+02 -8.78629981e+00 4.63850062e+00 8.90861345e+01
1716.lowfreq: -4.9887 -0.0008 -0.0004 0.0007 7.1122 16.1814 22.0230 45.4409 51.5540
frequency: 21.7440 45.3254 51.3469 81.6254 158.4708 189.6762 201.5613 215.5538 230.8150 251.3523 259.6114 362.7464 376.4358 415.9178 426.0795 462.5376 489.0407 532.9737 552.5643 586.9294 646.1937 662.3100 710.3476 754.1202 773.1058 809.5174 840.3260 848.6432 853.3111 897.7152 913.0226 919.5361 926.4724 937.6904 957.3575 969.6619 1015.5977 1043.0379 1086.8513 1101.2718 1124.4459 1127.5557 1145.8518 1158.2573 1163.6248 1174.5050 1190.6210 1224.1285 1230.4529 1251.7591 1269.5823 1290.8119 1311.5540 1323.7336 1345.8531 1367.7611 1378.5829 1390.0459 1399.1545 1445.6656 1446.8927 1459.0207 1463.1545 1464.5090 1472.2376 1478.2542 1482.8307 1485.1273 1605.5961 1617.4162 2897.8115 2964.7694 2967.1829 2973.2720 2979.9699 3023.0769 3040.5371 3060.5530 3060.9284 3071.0825 3072.4756 3095.7136 3126.2362 3136.4603 3158.3362 3173.1739 3421.8593
redmass: 3.9778 2.9308 3.3642 3.6997 2.2944 2.3976 1.0917 3.6741 2.7142 1.7029 2.4056 3.0416 2.3595 2.7349 2.5428 2.1297 2.9011 3.5734 4.9214 6.5747 1.9778 3.2462 3.0009 1.3689 5.2109 2.6324 2.9021 2.6492 1.5963 1.7569 1.3223 2.2091 1.4365 1.4431 2.1819 1.2996 2.0901 1.7206 2.4228 2.6922 1.3545 2.2312 2.0306 2.1700 1.0999 2.0660 1.7495 1.4785 2.2534 1.3754 1.4204 1.4355 1.4070 1.2745 1.3808 1.3016 1.3913 1.2292 5.5583 1.4987 1.6758 1.2085 1.0621 1.0529 2.3817 1.0741 1.0862 1.0520 7.1774 7.6388 1.0693 1.0678 1.0357 1.0473 1.0743 1.0853 1.0915 1.0952 1.0985 1.0972 1.0994 1.1001 1.0862 1.0906 1.0956 1.0982 1.0735
irintensity: 0.2540 0.2937 0.1301 0.5467 2.5257 1.0991 0.9744 0.4562 8.4087 1.7236 1.3887 7.4843 0.8490 5.1327 1.7060 1.8458 14.4185 0.5212 9.7188 2.0446 63.5770 25.2714 5.6036 97.5030 2.2837 10.5620 8.0245 35.8271 7.9644 22.9499 3.1070 28.5432 7.1882 1.3114 17.7316 0.0327 9.9141 5.8245 8.7954 24.1311 40.5549 21.0949 19.5163 26.0379 9.4827 70.4257 10.3365 1.4446 127.5981 0.7292 5.2409 3.7049 7.0513 9.9493 5.7782 21.6697 5.9956 28.2819 9.5012 10.1102 50.0728 7.4595 4.7326 1.8027 87.8523 7.8398 7.2887 18.5461 19.7775 17.6167 63.8880 38.7721 25.7015 18.3526 31.8098 14.3206 28.5702 31.9022 5.4678 86.5368 51.1501 35.5689 1.3007 17.0338 29.8716 13.1689 1.6311
temp: 298.150 k
press: 1.00000 atm
elementType: 8 7 6 6 6 6 6 6 6 6 6 6 6 6 1 1 1 1 1 1 1 1 1 1 1 1 1 1 1 1 1
symmnumber: 1
zpe: 694377.3 jmol-1
zpe.correction: 0.264474 hartree
zpe.thermalcorrener: 0.278331 hartree
zpe.thermalcorrenthalpy: 0.279275 hartree
zpe.thermalcorrgfe: 0.222647 hartree
zpe.sumelectzpe: -596.372054 hartree
zpe.sumelectthermal: -596.358198 hartree
zpe.sumelectthermalent: -596.357254 hartree
zpe.sumelectthermalfe: -596.413882 hartree
dipole: 1.5490 1.4779 0.9516
dipole: 2.3429
quadrupole: -77.3116 -81.6029 -88.6364
quadrupole: -1.0561 0.6265 1.5128
quadrupole: 5.2053 0.9140 -6.1194 -1.0561 0.6265 1.5128
hfenergy: -596.6365287 hartree
pointgroup: C01 [X(C12H17N1O1)]
dipole: 0.6010341 0.6383263 0.2845364 debye
polarizability: 193.6185229|0.4310929|130.1163281|-6.0609825|-2.5934612|88.3089954 unknown
InChI: InChI=1S/C12H17NO/c1-9(2)13-8-11-7-10-5-3-4-6-12(10)14-11/h3-6,9,11,13H,7-8H2,1-2H3
charge 0 multiplicity 1
31 atoms
O  -0.664048 -1.332728 -0.255633
N  2.745125 0.274393 -0.224234
C  0.37721 -0.287256 -0.60086
C  -0.278157 1.094645 -0.284127
C  1.645692 -0.620219 0.193545
C  -1.755607 0.748745 -0.147624
C  -1.889278 -0.660006 -0.112803
C  4.129349 -0.181431 0.074549
C  -2.895245 1.559201 -0.011608
C  -3.13014 -1.298108 0.056737
C  4.42557 -0.360936 1.589725
C  5.123315 0.802464 -0.574748
C  -4.163615 0.941961 0.154957
C  -4.272592 -0.469425 0.191101
H  0.580473 -0.39093 -1.682324
H  -0.074993 1.827606 -1.083416
H  0.113992 1.513284 0.665634
H  1.939546 -1.660639 -0.039177
H  1.402747 -0.585188 1.282158
H  2.599265 1.243174 0.095014
H  4.244297 -1.168582 -0.418316
H  -2.811201 2.651913 -0.032235
H  -3.203674 -2.389072 0.080147
H  4.357312 0.61038 2.117692
H  3.709496 -1.059494 2.059938
H  5.44365 -0.763458 1.74809
H  4.92605 0.8895 -1.656996
H  6.165307 0.466212 -0.427504
H  5.029223 1.810507 -0.123952
H  -5.061879 1.560273 0.256028
H  -5.256591 -0.933986 0.321241
