program: Orca
programVersion: 4.2.1
elementType: Cl Cl O O O N N N C C C C C C C C C C C C C C C C C C C H H H H H H H H H H H H H H H H H
charge: 0
multiplicity: 1
keywords: wb97x-d3
keywords: def2-TZVPP
keywords: def2/J RIJCOSX GRIDX6 NOFINALGRIDX
keywords: grid4 nofinalgrid
keywords: scfconv7
keywords: smallprint printgap noloewdin
keywords: NOSOSCF
formula: C19H17Cl2N3O3
InChI: InChI=1S/C19H17Cl2N3O3/c1-13-9-25-19(27-13,10-24-12-22-11-23-24)17-7-6-16(8-18(17)21)26-15-4-2-14(20)3-5-15/h2-8,11-13H,9-10H2,1H3
44 atoms
Cl 2.24011 -1.000306 -1.967152
Cl -7.209474 0.049458 1.174439
O  3.936202 0.134142 0.079898
O  3.175715 1.421053 1.712884
O  -2.183566 1.270227 -1.572704
N  2.390788 -2.101478 1.162867
N  1.122936 -2.47709 0.963994
N  2.534151 -3.948143 0.028258
C  2.844153 0.318461 0.911976
C  4.369761 1.427966 -0.298493
C  2.715366 -0.884379 1.849941
C  3.967996 2.283731 0.920324
C  1.540012 0.586458 0.161059
C  5.849135 1.403608 -0.599109
C  1.189757 0.034537 -1.068438
C  0.586586 1.385409 0.791863
C  -0.0568 0.265503 -1.635281
C  -0.658813 1.626972 0.248013
C  -0.978188 1.053834 -0.974371
C  3.218802 -2.988619 0.591167
C  1.258385 -3.585826 0.279288
C  -3.321173 0.965418 -0.885225
C  -4.462477 1.687145 -1.205925
C  -3.378044 -0.045768 0.066014
C  -5.661967 1.401074 -0.577133
C  -4.578585 -0.324118 0.699657
C  -5.715365 0.399094 0.378977
H  3.817111 1.756401 -1.188228
H  1.93661 -0.693764 2.586897
H  3.661924 -1.014566 2.377009
H  4.831317 2.60296 1.509746
H  3.406448 3.172958 0.619826
H  6.421624 1.083346 0.272012
H  6.06914 0.72827 -1.424947
H  6.192077 2.398321 -0.884801
H  0.830292 1.832682 1.745716
H  -0.312669 -0.179064 -2.587137
H  -1.372988 2.25001 0.770004
H  4.292748 -2.888937 0.611716
H  0.40532 -4.160309 -0.045562
H  -4.40984 2.469602 -1.951225
H  -2.498342 -0.624511 0.317077
H  -6.551159 1.962936 -0.826789
H  -4.624878 -1.111127 1.439427
totalener: -2044.66639741 hartree
nucrepener: 2784.71963439 hartree
electener: -4829.38603180 hartree
oneelecener: -8340.01163063 hartree
twoeener: 3510.62559883 hartree
kineticenergy: 2038.72825985 hartree
xcener: -149.991387729366 hartree
chargesum: -0.0000000
charge: -0.054866 -0.084088 -0.338098 -0.353068 -0.301156 0.099504 -0.322031 -0.322774 0.572760 0.097128 -0.074818 0.018633 -0.080487 -0.271841 -0.033985 -0.154397 -0.141762 -0.169767 0.179331 0.045774 0.070908 0.236540 -0.215983 -0.145612 -0.091393 -0.132811 0.064722 0.078811 0.120202 0.108300 0.082394 0.078665 0.078532 0.100617 0.085508 0.134368 0.119568 0.136899 0.139708 0.126875 0.127736 0.138917 0.121920 0.124618
qa: -0.0549 -0.0841 -0.3381 -0.3531 -0.3012 0.0995 -0.3220 -0.3228 0.5728 0.0971 -0.0748 0.0186 -0.0805 -0.2718 -0.0340 -0.1544 -0.1418 -0.1698 0.1793 0.0458 0.0709 0.2365 -0.2160 -0.1456 -0.0914 -0.1328 0.0647 0.0788 0.1202 0.1083 0.0824 0.0787 0.0785 0.1006 0.0855 0.1344 0.1196 0.1369 0.1397 0.1269 0.1277 0.1389 0.1219 0.1246
va: 1.2618 1.2205 2.0329 2.0107 2.1005 3.3171 2.8213 3.0570 3.8499 3.8854 3.8584 3.9418 3.5984 3.9745 3.9857 3.9982 4.0716 3.9950 3.9167 4.0911 4.0339 3.8209 4.0390 3.9149 3.9826 4.0118 3.9265 1.0010 1.0154 1.0235 0.9974 0.9968 1.0102 1.0055 1.0043 1.0261 1.0278 1.0035 1.0086 1.0027 1.0130 1.0114 1.0095 1.0110
dispcorr: -0.025685908 hartree
energy: -2044.692083316400
dipole: 27.68912 -26.49459 1.19453 10.72534 -9.06612 1.65922 4.05525 -3.71719 0.33806
magnitude: 2.07225 au
magnitude: 5.26723 debye
