program: Gaussian 09
title: 000030195
version: EM64L-G09RevD.01
frameworkgroup: C1[X(C14H26O5)]
method: RPBEPBE
basis: SDD
operation: Freq
keyword: #pfreq=noraman
keyword: PBEPBE/SDD
title: #p freq=noraman PBEPBE/SDD
converged: YES YES NO NO
title: Mulliken charges:
elementType: O O O O O C C C C C C C C C C C C C C H H H H H H H H H H H H H H H H H H H H H H H H H H
charge: -0.274513 -0.269834 -0.273836 -0.217311 -0.232786 0.106298 -0.404653 -0.420514 -0.377758 0.172714 0.182780 -0.321098 -0.354393 -0.701873 -0.223422 -0.221323 -0.498935 -0.673612 -0.674528 0.208760 0.218746 0.244857 0.224470 0.202751 0.219051 0.225142 0.207297 0.197931 0.192720 0.212041 0.215040 0.211940 0.230952 0.226801 0.235405 0.226564 0.199456 0.230074 0.202327 0.212416 0.228864 0.232469 0.213562 0.228978 0.229985
chargesum: 0.00000
title: Mulliken charges with hydrogens summed into heavy atoms:
elementType: O O O O O C C C C C C C C C C C C C C
charge: -0.274513 -0.269834 -0.273836 -0.217311 -0.232786 0.106298 0.022853 0.048813 0.044045 0.172714 0.182780 0.111341 0.036257 -0.062852 0.234331 0.240646 0.132922 0.000137 -0.002004
polarizability: 1.94085310e+02 -5.98364373e+00 1.71239483e+02 -1.43428572e-01 -1.05884689e+00 1.43121512e+02
1716.lowfreq: -10.5575 -6.8065 -0.0005 -0.0003 0.0003 4.7105 13.2936 21.7328 36.8284
frequency: 12.0372 21.5044 36.7286 41.9006 51.3357 55.0102 59.6875 62.6899 76.4285 81.6960 100.9606 110.5833 128.8583 140.6917 150.7917 165.3690 197.8001 212.1762 222.6281 232.2953 233.4266 242.6739 253.3867 256.9521 275.2164 292.8674 306.9931 336.9745 383.4821 385.9015 400.8795 455.1485 533.3046 589.3770 639.3871 714.4380 728.4663 741.5593 789.1668 794.8518 797.7221 799.5408 800.2511 816.3683 845.0319 889.8475 896.2980 901.1547 953.9429 984.6964 1022.3503 1023.0064 1044.1926 1057.5953 1066.0015 1072.8025 1087.9678 1092.9473 1100.7579 1111.5344 1113.4644 1116.0609 1124.0091 1135.2785 1135.8014 1152.5726 1164.4991 1178.1341 1207.5308 1247.5068 1248.7359 1254.4985 1264.5174 1281.7509 1294.8305 1300.1044 1328.0760 1337.2032 1353.9975 1356.8019 1361.1762 1388.7193 1394.3974 1398.2915 1401.9883 1438.9608 1449.3534 1457.4341 1461.7131 1463.2898 1463.6926 1465.0172 1470.5524 1473.3451 1474.1138 1475.6812 1478.2197 1485.9760 1486.4929 1487.1706 1487.2429 1611.3994 1643.0579 2921.9961 2943.7990 2962.0173 2973.4306 2981.7596 2993.8230 2994.3824 2995.0429 2995.4792 3003.5095 3006.6854 3009.8074 3010.2447 3011.8736 3039.8425 3063.2602 3068.0335 3070.4542 3071.6837 3072.1760 3081.7074 3091.6816 3092.1253 3099.1946 3106.6620 3106.7648
redmass: 3.7498 3.2860 3.3539 3.6267 1.7184 2.6867 2.1776 2.3246 3.5105 2.8311 3.9299 3.1133 3.1311 2.6917 2.7211 2.8368 3.1959 2.2975 1.2492 3.4565 1.3051 1.4438 2.1045 1.8474 2.7167 3.1182 5.4653 4.6121 3.9755 3.6306 3.0069 3.4277 6.5070 4.6913 2.9691 2.8253 1.5849 3.3448 1.3196 3.8866 1.4336 1.1679 2.0243 1.6143 4.2810 3.4458 2.0886 1.8045 1.6370 5.2496 2.3617 2.3311 3.1909 2.6637 4.8740 3.3855 2.0196 2.4678 2.8691 2.2491 2.2582 1.2894 3.0893 1.4691 1.4855 4.1511 1.6709 1.6042 1.4449 1.1350 1.1355 1.5400 1.3203 1.1392 1.0922 1.3446 1.3271 1.3556 1.4029 1.4267 1.4782 1.2143 1.3046 1.2674 1.2643 1.1603 1.0833 1.0520 1.0408 1.0653 1.0761 1.0577 1.0639 1.0608 1.0572 1.0668 1.0422 1.0694 1.0737 1.0762 1.0761 11.5751 11.6214 1.0349 1.0573 1.0587 1.0360 1.0619 1.0609 1.1015 1.0362 1.0360 1.0922 1.0969 1.0617 1.0679 1.0583 1.0991 1.1030 1.1065 1.1063 1.1013 1.0994 1.1015 1.0985 1.0985 1.0972 1.1026 1.1028
irintensity: 1.0078 0.4054 0.0402 0.1639 0.3019 0.4859 6.2529 1.8168 3.0170 0.4534 0.2732 0.3908 2.6986 4.8512 2.7332 3.3860 0.9071 0.8658 2.1832 0.7293 1.0805 0.3025 3.7240 0.5573 0.6792 6.5151 0.1517 18.4266 3.7330 1.1408 0.9325 3.6786 14.9059 6.3406 1.0922 1.0040 13.3598 0.2567 0.1566 3.8382 7.4314 2.2748 5.3299 1.2817 0.9136 20.1868 2.2229 3.0078 63.9155 1.5066 49.6013 79.3718 3.3215 427.5577 141.1331 27.2216 207.2173 32.1501 4.5300 5.0686 6.8257 3.3332 6.7801 5.2686 6.0663 2.3888 6.9412 29.8899 23.0806 0.0696 0.0650 63.5287 8.4826 0.2473 3.7571 2.3465 33.2376 3.5342 1.1819 0.2601 2.0188 14.8122 6.8377 25.5451 20.0292 0.4780 1.0435 11.5465 11.5314 0.9536 15.9103 8.1290 14.6939 3.9449 5.9962 3.6919 11.6597 10.0192 2.3141 28.6679 3.2642 113.4932 200.8079 86.8869 46.1627 27.3553 35.2329 20.1970 22.5746 86.9015 28.5406 16.2596 16.7550 7.4138 45.9827 8.2259 19.1979 5.2843 4.8684 7.3582 5.3691 100.7169 53.2745 33.8386 28.7057 29.2146 35.6373 32.6610 50.6891
temp: 298.150 k
press: 1.00000 atm
elementType: 8 8 8 8 8 6 6 6 6 6 6 6 6 6 6 6 6 6 6 1 1 1 1 1 1 1 1 1 1 1 1 1 1 1 1 1 1 1 1 1 1 1 1 1 1
symmnumber: 1
zpe: 1004622.3 jmol-1
zpe.correction: 0.382640 hartree
zpe.thermalcorrener: 0.407203 hartree
zpe.thermalcorrenthalpy: 0.408147 hartree
zpe.thermalcorrgfe: 0.324555 hartree
zpe.sumelectzpe: -923.642910 hartree
zpe.sumelectthermal: -923.618347 hartree
zpe.sumelectthermalent: -923.617403 hartree
zpe.sumelectthermalfe: -923.700995 hartree
dipole: 0.2594 0.3162 -1.2081
dipole: 1.2754
quadrupole: -101.5467 -101.5844 -128.2585
quadrupole: -9.4206 -4.4357 -0.6550
quadrupole: 8.9165 8.8788 -17.7953 -9.4206 -4.4357 -0.6550
hfenergy: -924.0255501 hartree
pointgroup: C01 [X(C14H26O5)]
dipole: -0.1188138 0.1096924 0.4750159 debye
polarizability: 193.2460183|7.3151628|172.0182531|0.8954589|1.6885016|143.182033 unknown
InChI: InChI=1S/C14H26O5/c1-5-8-9-14(10-11-17-4,12(15)18-6-2)13(16)19-7-3/h5-11H2,1-4H3
charge 0 multiplicity 1
45 atoms
O  1.492497 1.788609 -0.114156
O  -1.664512 -1.824287 -0.167067
O  3.350773 -1.684501 1.463559
O  0.159385 1.186396 -1.920635
O  0.134746 -1.817126 -1.632661
C  0.062186 -0.136832 0.192263
C  -1.028818 0.514125 1.11351
C  1.197819 -0.702541 1.113673
C  -2.19434 1.228866 0.395335
C  0.568132 0.964862 -0.760988
C  -0.467423 -1.308209 -0.661206
C  2.414993 -1.299514 0.396505
C  -3.261501 1.728741 1.396396
C  -4.423803 2.472984 0.704568
C  1.974564 2.970646 -0.895397
C  -2.201079 -3.025049 -0.883643
C  4.561138 -2.303292 0.931105
C  2.92252 3.742606 0.016053
C  -3.511784 -3.395283 -0.197923
H  -0.50591 1.233795 1.773383
H  -1.436258 -0.288645 1.755636
H  1.555066 0.121496 1.755081
H  0.758123 -1.473295 1.774959
H  -1.817965 2.090001 -0.191668
H  -2.667187 0.536872 -0.326819
H  2.146648 -2.18527 -0.214529
H  2.889194 -0.547086 -0.270672
H  -3.660154 0.863822 1.964936
H  -2.783585 2.397852 2.141681
H  -4.054671 3.357695 0.152223
H  -5.176565 2.819988 1.436206
H  -4.935874 1.815932 -0.023364
H  2.47013 2.599073 -1.81047
H  1.095108 3.566465 -1.20039
H  -2.334817 -2.758408 -1.947286
H  -1.445795 -3.829536 -0.823279
H  5.116543 -1.607908 0.265128
H  5.18964 -2.556774 1.799715
H  4.330002 -3.228723 0.360625
H  3.31066 4.630754 -0.515291
H  2.403173 4.083309 0.928081
H  3.779099 3.116072 0.318056
H  -3.956825 -4.277047 -0.694116
H  -3.347102 -3.641886 0.864957
H  -4.234771 -2.563549 -0.254875
