program: Orca
programVersion: 4.2.1
elementType: Cl Cl O O O N N N C C C C C C C C C C C C C C C C C C C H H H H H H H H H H H H H H H H H
charge: 0
multiplicity: 1
keywords: wb97x-d3
keywords: def2-TZVPP
keywords: def2/J RIJCOSX GRIDX6 NOFINALGRIDX
keywords: grid4 nofinalgrid
keywords: scfconv7
keywords: smallprint printgap noloewdin
keywords: NOSOSCF
formula: C19H17Cl2N3O3
InChI: InChI=1S/C19H17Cl2N3O3/c1-13-9-25-19(27-13,10-24-12-22-11-23-24)17-7-6-16(8-18(17)21)26-15-4-2-14(20)3-5-15/h2-8,11-13H,9-10H2,1H3
44 atoms
Cl 0.652527 0.659146 2.387457
Cl -7.058657 2.065844 0.572061
O  3.929835 0.114164 -0.662948
O  3.280458 1.263642 1.126727
O  -2.246298 -0.445838 -1.616054
N  3.138436 -2.347051 0.660902
N  2.012092 -3.027023 0.895709
N  3.220986 -4.041635 -0.696633
C  3.035823 0.091198 0.418384
C  4.272965 1.465385 -0.948886
C  3.397967 -1.0950 1.316468
C  3.536187 2.245358 0.150578
C  1.599873 0.001075 -0.088237
C  5.778557 1.62449 -0.914409
C  0.489247 0.229036 0.71946
C  1.352045 -0.385481 -1.402516
C  -0.806726 0.104491 0.242376
C  0.072481 -0.51341 -1.906135
C  -1.012395 -0.264197 -1.078915
C  3.844931 -2.963228 -0.299044
C  2.104773 -4.033454 0.063143
C  -3.337207 0.16339 -1.065604
C  -4.415386 -0.628848 -0.705899
C  -3.402264 1.543344 -0.923328
C  -5.567785 -0.042747 -0.206628
C  -4.548921 2.128705 -0.414545
C  -5.627536 1.333066 -0.058148
H  3.89073 1.734773 -1.939313
H  2.812197 -1.073709 2.232445
H  4.454695 -1.027704 1.579967
H  4.140005 3.034995 0.59899
H  2.605438 2.68737 -0.22315
H  6.061389 2.638375 -1.199806
H  6.170201 1.431038 0.085191
H  6.261956 0.938798 -1.609996
H  2.188658 -0.596731 -2.052965
H  -1.637899 0.280237 0.91141
H  -0.090012 -0.815468 -2.93181
H  4.790395 -2.595015 -0.664686
H  1.342285 -4.793973 0.004126
H  -4.355179 -1.702552 -0.823619
H  -2.563328 2.16366 -1.211451
H  -6.412289 -0.657687 0.071422
H  -4.605068 3.202503 -0.302734
totalener: -2044.66879891 hartree
nucrepener: 2758.86782912 hartree
electener: -4803.53662803 hartree
oneelecener: -8288.20433832 hartree
twoeener: 3484.66771029 hartree
kineticenergy: 2038.71693706 hartree
xcener: -149.988073245803 hartree
chargesum: -0.0000000
charge: -0.062425 -0.077439 -0.377841 -0.316615 -0.293663 0.108391 -0.302436 -0.329535 0.571866 0.109613 -0.107161 0.010903 -0.244312 -0.281715 0.042952 -0.053143 -0.159368 -0.257854 0.267988 0.039466 0.060965 0.233036 -0.197310 -0.172364 -0.094423 -0.107654 0.064884 0.070646 0.132282 0.111581 0.094204 0.082166 0.083813 0.087411 0.094203 0.135060 0.120697 0.128544 0.141231 0.128526 0.130421 0.135571 0.124572 0.124263
qa: -0.0624 -0.0774 -0.3778 -0.3166 -0.2937 0.1084 -0.3024 -0.3295 0.5719 0.1096 -0.1072 0.0109 -0.2443 -0.2817 0.0430 -0.0531 -0.1594 -0.2579 0.2680 0.0395 0.0610 0.2330 -0.1973 -0.1724 -0.0944 -0.1077 0.0649 0.0706 0.1323 0.1116 0.0942 0.0822 0.0838 0.0874 0.0942 0.1351 0.1207 0.1285 0.1412 0.1285 0.1304 0.1356 0.1246 0.1243
va: 1.2647 1.2272 1.9855 2.0503 2.1177 3.3267 2.8582 3.0663 3.8596 3.9111 3.8433 3.9543 3.6785 3.9702 4.0255 3.8412 3.9755 4.1187 3.8318 4.0869 4.0482 3.8295 4.0508 3.9891 3.9652 3.9808 3.9422 0.9975 1.0303 1.0206 0.9939 1.0014 1.0080 1.0076 1.0071 1.0228 1.0286 1.0150 1.0134 1.0024 1.0115 1.0019 1.0094 1.0106
dispcorr: -0.025222121 hartree
energy: -2044.694021031773
dipole: 32.09109 -31.27017 0.82092 0.96605 0.44087 1.40692 -11.18526 10.67604 -0.50923
magnitude: 1.70665 au
magnitude: 4.33796 debye
