program: Gaussian 09
title: 000030152
version: EM64L-G09RevD.01
frameworkgroup: C1[X(C8H18N)]
method: RPBEPBE
basis: SDD
operation: Freq
keyword: #p
keyword: freq=noraman
keyword: PBEPBE/SDD
title: #p freq=noraman PBEPBE/SDD
converged: NO YES NO NO
title: Mulliken charges:
elementType: N C C C C C C C C H H H H H H H H H H H H H H H H H H
charge: -0.091631 -0.331199 -0.331203 -0.402513 -0.402513 -0.409899 -0.409895 -0.576795 -0.576788 0.262068 0.252800 0.262065 0.252803 0.214417 0.257638 0.214422 0.257636 0.247830 0.217061 0.247829 0.217058 0.266501 0.273746 0.274161 0.274160 0.266500 0.273742
chargesum: 1.00000
title: Mulliken charges with hydrogens summed into heavy atoms:
elementType: N C C C C C C C C
charge: -0.091631 0.183668 0.183665 0.069542 0.069545 0.054992 0.054992 0.237613 0.237614
polarizability: 9.55349508e+01 -5.90370953e-05 8.59088861e+01 -3.63288683e-05 3.26977346e-01 7.73536597e+01
1716.lowfreq: -32.1521 -16.8112 -0.0009 -0.0007 -0.0006 9.8490 116.7547 167.8298 232.4545
frequency: 116.6128 167.8171 232.4503 256.0410 271.7123 280.0775 308.9602 317.3798 371.4536 400.1766 417.3222 454.9997 499.9734 504.5433 646.9761 778.7719 785.3583 816.0969 846.0329 875.7399 888.9582 937.1662 959.7583 981.9116 1003.4454 1011.3759 1072.8703 1080.8336 1093.6701 1127.6524 1135.7563 1181.5078 1197.0597 1209.3148 1215.3379 1250.0445 1284.6918 1309.3544 1309.9846 1341.8485 1344.9790 1359.5638 1359.8844 1367.6664 1379.1862 1421.6608 1442.8893 1453.8060 1456.8711 1459.4071 1466.8711 1471.2888 1473.2080 1482.0150 1484.6253 1485.0676 1493.0822 2981.5145 2984.2060 2989.6443 2990.2249 3021.2437 3022.0831 3022.1422 3026.1629 3046.9299 3048.2475 3050.4698 3059.5528 3090.4737 3090.8601 3137.6765 3141.1872 3143.8685 3147.0435
redmass: 2.5324 2.1374 1.8407 1.0217 1.2396 2.8670 2.0919 2.0765 2.0705 2.4808 2.1171 2.3792 1.5172 2.2102 3.0042 2.9344 1.7073 1.8201 1.6168 2.6993 2.3741 2.9329 1.7912 1.8045 1.6893 2.4794 1.4069 2.4251 1.2619 1.7618 1.9829 1.4346 1.4444 1.7603 1.1840 1.3835 1.1687 1.1687 1.3243 1.3462 1.3829 1.4088 1.2689 1.3980 1.3098 1.1504 1.1507 1.0722 1.0799 1.0681 1.0567 1.0743 1.0839 1.0521 1.0768 1.0516 1.0781 1.0694 1.0641 1.0623 1.0624 1.0612 1.0454 1.0326 1.0498 1.0943 1.0966 1.0950 1.1021 1.1068 1.1060 1.1058 1.1051 1.1047 1.1055
irintensity: 0.2947 0.0044 0.7448 0.0154 0.1063 1.4060 0.3435 0.4877 0.0440 0.1917 0.0184 1.1011 1.4216 0.0164 0.5440 0.0031 0.6083 3.0649 0.0192 40.9648 34.9174 2.3524 0.7939 15.3533 3.7648 3.6530 0.7022 1.6374 0.1847 0.3036 1.8376 0.5159 0.0309 2.6150 0.0323 0.1297 0.4919 5.2361 4.1177 0.2656 0.6522 0.2880 0.1897 0.0745 1.1704 18.6860 4.8269 32.7119 0.8665 1.2250 6.6300 8.0858 22.8769 31.6348 0.1906 32.6858 81.8447 5.1011 17.2486 31.8901 11.5641 3.6190 1.1458 5.0676 15.4035 28.9098 0.2403 19.1115 38.0547 5.6066 13.1745 0.0243 6.8614 3.0887 4.7439
temp: 298.150 k
press: 1.00000 atm
elementType: 7 6 6 6 6 6 6 6 6 1 1 1 1 1 1 1 1 1 1 1 1 1 1 1 1 1 1
symmnumber: 1
zpe: 665941.0 jmol-1
zpe.correction: 0.253644 hartree
zpe.thermalcorrener: 0.263256 hartree
zpe.thermalcorrenthalpy: 0.264200 hartree
zpe.thermalcorrgfe: 0.220324 hartree
zpe.sumelectzpe: -369.391130 hartree
zpe.sumelectthermal: -369.381518 hartree
zpe.sumelectthermalent: -369.380573 hartree
zpe.sumelectthermalfe: -369.424450 hartree
dipole: 3.5869 0.0000 0.0000
dipole: 3.5869
quadrupole: -39.4350 -47.4813 -49.8392
quadrupole: 0.0000 0.0000 0.0161
quadrupole: 6.1502 -1.8961 -4.2541 0.0000 0.0000 0.0161
hfenergy: -369.6447738 hartree
pointgroup: C01 [X(C8H18N1)]
dipole: -1.4111867 0.000078 0.0000597 debye
polarizability: 95.5349507|-0.0006607|85.9201096|-0.0007287|-0.1037738|77.3424363 unknown
InChI: InChI=1S/C8H18N/c1-9(2)7-5-3-4-6-8-9/h3-8H2,1-2H3
charge 1 multiplicity 1
27 atoms
N  -1.209418 0.000091 0.000054
C  -0.355784 1.138665 -0.626976
C  -0.355891 -1.138618 0.627003
C  0.907105 1.547718 0.156855
C  0.906897 -1.547821 -0.156914
C  2.170131 0.737729 -0.227725
C  2.17005 -0.737978 0.227544
C  -2.099893 0.582826 1.09739
C  -2.100076 -0.582532 -1.097203
H  -1.057733 1.983718 -0.739242
H  -0.073954 0.795352 -1.63732
H  -1.05795 -1.983577 0.739277
H  -0.073956 -0.795368 1.637338
H  0.734601 1.521785 1.251507
H  1.088325 2.612244 -0.083958
H  0.734303 -1.521922 -1.251554
H  1.088011 -2.612358 0.083932
H  3.056018 1.239698 0.202795
H  2.294206 0.788354 -1.328387
H  3.055835 -1.240071 -0.203042
H  2.294213 -0.788607 1.328198
H  -2.8521 1.244086 0.640343
H  -2.601081 -0.240154 1.629972
H  -1.477155 1.155486 1.800538
H  -1.477465 -1.155216 -1.800445
H  -2.852286 -1.243744 -0.64009
H  -2.601254 0.240515 -1.629691
