program: Orca
programVersion: 4.2.1
elementType: Cl Cl O O O N N N C C C C C C C C C C C C C C C C C C C H H H H H H H H H H H H H H H H H
charge: 0
multiplicity: 1
keywords: wb97x-d3
keywords: def2-TZVPP
keywords: def2/J RIJCOSX GRIDX6 NOFINALGRIDX
keywords: grid4 nofinalgrid
keywords: scfconv7
keywords: smallprint printgap noloewdin
keywords: NOSOSCF
formula: C19H17Cl2N3O3
InChI: InChI=1S/C19H17Cl2N3O3/c1-13-9-25-19(27-13,10-24-12-22-11-23-24)17-7-6-16(8-18(17)21)26-15-4-2-14(20)3-5-15/h2-8,11-13H,9-10H2,1H3
44 atoms
Cl 2.040312 1.755578 2.641898
Cl -6.541105 -1.787953 -1.211635
O  3.637819 -0.340283 -1.020355
O  4.152786 0.914968 0.74036
O  -2.167315 1.931033 -0.049492
N  1.908784 -1.92884 0.980299
N  1.733056 -2.706763 -0.091638
N  -0.187238 -2.502189 1.050016
C  3.182311 0.053143 0.240127
C  4.529963 0.648431 -1.520408
C  3.115759 -1.172811 1.171666
C  4.600508 1.660147 -0.367889
C  1.802259 0.698731 0.128871
C  5.85835 0.006366 -1.860068
C  1.204345 1.415979 1.161561
C  1.021563 0.435455 -0.994394
C  -0.117356 1.829238 1.09434
C  -0.295883 0.839737 -1.087142
C  -0.870073 1.524073 -0.026079
C  0.748886 -1.806857 1.643105
C  0.467513 -3.032929 -0.006766
C  -3.14222 1.013894 -0.327475
C  -4.299943 1.495306 -0.921785
C  -3.028599 -0.331473 0.000822
C  -5.350444 0.634242 -1.188855
C  -4.079551 -1.191338 -0.276012
C  -5.234561 -0.709118 -0.869009
H  4.097508 1.107368 -2.415341
H  3.142542 -0.835528 2.206623
H  3.977744 -1.813345 0.992272
H  5.610842 2.015979 -0.164529
H  3.954563 2.526884 -0.549383
H  5.725656 -0.816592 -2.561236
H  6.526408 0.733744 -2.321967
H  6.345882 -0.383299 -0.965872
H  1.45332 -0.131474 -1.806506
H  -0.568161 2.366204 1.917732
H  -0.877109 0.602054 -1.968112
H  0.641082 -1.214905 2.539556
H  -0.001791 -3.683456 -0.727896
H  -4.378657 2.545337 -1.170124
H  -2.138683 -0.734152 0.469468
H  -6.253151 1.008793 -1.651026
H  -3.991198 -2.237609 -0.019002
totalener: -2044.66690474 hartree
nucrepener: 2822.45594066 hartree
electener: -4867.12284540 hartree
oneelecener: -8415.34200166 hartree
twoeener: 3548.21915626 hartree
kineticenergy: 2038.72572013 hartree
xcener: -149.991093901467 hartree
chargesum: 0.0000000
charge: -0.060550 -0.085976 -0.352073 -0.320171 -0.303270 0.120453 -0.295462 -0.360966 0.585188 0.118804 -0.124792 0.002306 -0.165382 -0.277436 -0.024068 -0.097795 -0.172692 -0.184647 0.221713 0.048409 0.070236 0.217071 -0.197570 -0.123723 -0.107853 -0.177542 0.090417 0.067875 0.133118 0.107869 0.095729 0.083485 0.098558 0.081497 0.085354 0.143879 0.119891 0.135292 0.143974 0.128818 0.127809 0.154183 0.121256 0.128780
qa: -0.0605 -0.0860 -0.3521 -0.3202 -0.3033 0.1205 -0.2955 -0.3610 0.5852 0.1188 -0.1248 0.0023 -0.1654 -0.2774 -0.0241 -0.0978 -0.1727 -0.1846 0.2217 0.0484 0.0702 0.2171 -0.1976 -0.1237 -0.1079 -0.1775 0.0904 0.0679 0.1331 0.1079 0.0957 0.0835 0.0986 0.0815 0.0854 0.1439 0.1199 0.1353 0.1440 0.1288 0.1278 0.1542 0.1213 0.1288
va: 1.2618 1.2188 2.0178 2.0456 2.1027 3.3172 2.8731 3.0027 3.8328 3.9084 3.8635 3.9522 3.6939 3.9704 3.9649 3.8570 4.0956 4.0208 3.8750 4.0387 4.0258 3.8092 4.0210 3.8702 3.9995 4.0633 3.8952 0.9973 1.0085 1.0325 0.9946 1.0009 1.0080 1.0068 1.0079 1.0307 1.0281 1.0045 1.0045 1.0028 1.0128 1.0141 1.0103 1.0131
dispcorr: -0.027458456 hartree
energy: -2044.694363192114
dipole: 27.85356 -26.38042 1.47315 1.41918 -0.42426 0.99492 -10.13463 9.76049 -0.37414
magnitude: 1.81659 au
magnitude: 4.61742 debye
