program: Orca
programVersion: 4.2.1
elementType: Cl Cl O O O N N N C C C C C C C C C C C C C C C C C C C H H H H H H H H H H H H H H H H H
charge: 0
multiplicity: 1
keywords: wb97x-d3
keywords: def2-TZVPP
keywords: def2/J RIJCOSX GRIDX6 NOFINALGRIDX
keywords: grid4 nofinalgrid
keywords: scfconv7
keywords: smallprint printgap noloewdin
keywords: NOSOSCF
formula: C19H17Cl2N3O3
InChI: InChI=1S/C19H17Cl2N3O3/c1-13-9-25-19(27-13,10-24-12-22-11-23-24)17-7-6-16(8-18(17)21)26-15-4-2-14(20)3-5-15/h2-8,11-13H,9-10H2,1H3
44 atoms
Cl 1.61539 1.057194 2.872408
Cl -7.158812 1.446528 -2.895199
O  2.540639 -0.935058 -1.074876
O  3.233963 0.546635 0.441197
O  -3.076766 0.758339 1.243147
N  4.133117 -2.13977 0.909469
N  5.184169 -1.632584 1.559014
N  5.856939 -3.122295 0.022251
C  2.379797 -0.53068 0.258249
C  3.171532 0.10958 -1.812296
C  2.795894 -1.690084 1.169998
C  3.24727 1.239652 -0.782764
C  0.920842 -0.15858 0.522369
C  4.524193 -0.343644 -2.320429
C  0.501483 0.53875 1.656101
C  -0.068237 -0.550181 -0.374207
C  -0.830842 0.853105 1.866172
C  -1.407952 -0.25916 -0.183136
C  -1.787379 0.45386 0.945085
C  4.553799 -3.022851 -0.008872
C  6.193639 -2.249365 0.997072
C  -3.991581 0.907363 0.239823
C  -5.179782 0.201063 0.332038
C  -3.776524 1.783809 -0.815643
C  -6.161726 0.371594 -0.631081
C  -4.752815 1.946349 -1.783513
C  -5.941723 1.239081 -1.688188
H  2.526053 0.382967 -2.652917
H  2.105026 -2.5198 1.012515
H  2.732024 -1.394888 2.21527
H  4.166521 1.821927 -0.843683
H  2.392816 1.922885 -0.86592
H  4.439416 -1.257661 -2.907349
H  4.959681 0.42298 -2.963242
H  5.216924 -0.531906 -1.49942
H  0.218466 -1.107691 -1.254571
H  -1.130053 1.403536 2.747576
H  -2.139458 -0.593751 -0.906027
H  3.883126 -3.558674 -0.661976
H  7.211476 -2.071096 1.306479
H  -5.339674 -0.47494 1.161371
H  -2.853778 2.345377 -0.883525
H  -7.091442 -0.175091 -0.559602
H  -4.591401 2.629335 -2.605815
totalener: -2044.66860037 hartree
nucrepener: 2698.98568379 hartree
electener: -4743.65428415 hartree
oneelecener: -8168.04559995 hartree
twoeener: 3424.39131580 hartree
kineticenergy: 2038.71961535 hartree
xcener: -149.988934475624 hartree
chargesum: -0.0000000
charge: -0.049993 -0.075749 -0.386053 -0.303008 -0.296817 0.121355 -0.288729 -0.329339 0.578504 0.120283 -0.133663 0.012553 -0.201418 -0.278515 0.037187 -0.108104 -0.215784 -0.186382 0.234982 0.016833 0.046546 0.237244 -0.204406 -0.170386 -0.092505 -0.108741 0.061370 0.067871 0.124499 0.134940 0.095292 0.077818 0.093081 0.093275 0.094907 0.138344 0.121459 0.134624 0.139923 0.128507 0.130994 0.136731 0.125244 0.125225
qa: -0.0500 -0.0757 -0.3861 -0.3030 -0.2968 0.1214 -0.2887 -0.3293 0.5785 0.1203 -0.1337 0.0126 -0.2014 -0.2785 0.0372 -0.1081 -0.2158 -0.1864 0.2350 0.0168 0.0465 0.2372 -0.2044 -0.1704 -0.0925 -0.1087 0.0614 0.0679 0.1245 0.1349 0.0953 0.0778 0.0931 0.0933 0.0949 0.1383 0.1215 0.1346 0.1399 0.1285 0.1310 0.1367 0.1252 0.1252
va: 1.2722 1.2286 1.9874 2.0519 2.1123 3.3520 2.8704 3.0434 3.8606 3.9376 3.8060 3.9561 3.6430 3.9521 4.0182 3.9507 4.1088 3.9732 3.8579 4.0911 4.0471 3.8215 4.0488 3.9815 3.9644 3.9804 3.9440 0.9981 1.0032 1.0349 0.9956 1.0005 1.0103 1.0081 1.0039 1.0294 1.0302 1.0069 1.0096 1.0031 1.0112 1.0020 1.0091 1.0102
dispcorr: -0.024782652 hartree
energy: -2044.693383019408
dipole: 22.95362 -24.15871 -1.20508 -6.15673 6.60097 0.44424 -9.63032 8.81926 -0.81106
magnitude: 1.51901 au
magnitude: 3.86102 debye
