program: Orca
programVersion: 4.2.1
elementType: Cl Cl O O O N N N C C C C C C C C C C C C C C C C C C C H H H H H H H H H H H H H H H H H
charge: 0
multiplicity: 1
keywords: wb97x-d3
keywords: def2-TZVPP
keywords: def2/J RIJCOSX GRIDX6 NOFINALGRIDX
keywords: grid4 nofinalgrid
keywords: scfconv7
keywords: smallprint printgap noloewdin
keywords: NOSOSCF
formula: C19H17Cl2N3O3
InChI: InChI=1S/C19H17Cl2N3O3/c1-13-9-25-19(27-13,10-24-12-22-11-23-24)17-7-6-16(8-18(17)21)26-15-4-2-14(20)3-5-15/h2-8,11-13H,9-10H2,1H3
44 atoms
Cl 1.955692 0.033675 -2.733489
Cl -7.737564 0.629925 1.069042
O  3.496876 0.073328 -0.203315
O  2.491095 -0.48992 1.720812
O  -2.529186 1.717675 -1.3723
N  3.646992 -2.689579 0.412263
N  4.742832 -2.780188 -0.346268
N  5.153098 -3.558142 1.717174
C  2.392683 -0.580521 0.319802
C  3.915452 1.040842 0.739058
C  2.448015 -2.064327 -0.069837
C  3.580348 0.348551 2.054148
C  1.077441 0.039787 -0.142366
C  5.377939 1.351611 0.535275
C  0.807739 0.340572 -1.47766
C  0.068164 0.304159 0.778562
C  -0.405291 0.882135 -1.870795
C  -1.150394 0.84844 0.412357
C  -1.383777 1.13992 -0.923953
C  3.912351 -3.152039 1.644164
C  5.617188 -3.307716 0.473386
C  -3.717833 1.430583 -0.765068
C  -4.112823 0.123817 -0.508947
C  -4.560753 2.487822 -0.461208
C  -5.351287 -0.121046 0.059278
C  -5.804549 2.241943 0.097965
C  -6.192683 0.938671 0.361941
H  3.315737 1.956012 0.630978
H  2.414832 -2.182876 -1.150504
H  1.580527 -2.571938 0.354342
H  4.422776 -0.250845 2.418351
H  3.282198 1.045989 2.83927
H  5.721818 2.062348 1.28727
H  5.979945 0.44609 0.613006
H  5.550155 1.795036 -0.444309
H  0.243794 0.086217 1.822111
H  -0.591396 1.108412 -2.911699
H  -1.899745 1.048316 1.166571
H  3.179619 -3.178056 2.435305
H  6.626038 -3.529474 0.162457
H  -3.462954 -0.705774 -0.755854
H  -4.246629 3.501802 -0.66982
H  -5.663528 -1.136848 0.257718
H  -6.465127 3.064819 0.332752
totalener: -2044.66952270 hartree
nucrepener: 2694.12556361 hartree
electener: -4738.79508631 hartree
oneelecener: -8158.35276979 hartree
twoeener: 3419.55768348 hartree
kineticenergy: 2038.71920632 hartree
xcener: -149.988899401027 hartree
chargesum: 0.0000000
charge: -0.051529 -0.077060 -0.320132 -0.388157 -0.298367 0.120646 -0.296863 -0.332104 0.550462 0.131434 -0.126151 0.003151 -0.143874 -0.256826 0.032170 -0.117633 -0.212308 -0.171753 0.219712 0.019219 0.047715 0.238253 -0.164065 -0.212867 -0.112170 -0.088894 0.060822 0.068982 0.133268 0.121638 0.080711 0.093143 0.081200 0.085742 0.096482 0.136260 0.121047 0.136507 0.143920 0.130533 0.136681 0.130995 0.125453 0.124608
qa: -0.0515 -0.0771 -0.3201 -0.3882 -0.2984 0.1206 -0.2969 -0.3321 0.5505 0.1314 -0.1262 0.0032 -0.1439 -0.2568 0.0322 -0.1176 -0.2123 -0.1718 0.2197 0.0192 0.0477 0.2383 -0.1641 -0.2129 -0.1122 -0.0889 0.0608 0.0690 0.1333 0.1216 0.0807 0.0931 0.0812 0.0857 0.0965 0.1363 0.1210 0.1365 0.1439 0.1305 0.1367 0.1310 0.1255 0.1246
va: 1.2701 1.2275 2.0444 1.9733 2.1093 3.3548 2.8715 3.0509 3.8779 3.8917 3.8152 3.9537 3.6603 3.9750 4.0123 3.9541 4.1127 3.9641 3.8755 4.0725 4.0465 3.8226 3.9671 4.0484 3.9844 3.9654 3.9446 1.0028 1.0367 1.0050 0.9982 1.0021 1.0053 1.0105 1.0060 1.0318 1.0298 1.0054 1.0099 1.0017 1.0016 1.0116 1.0102 1.0092
dispcorr: -0.024254613 hartree
energy: -2044.693777316269
dipole: 26.03590 -26.78748 -0.75158 2.39712 -1.29192 1.10520 10.38327 -9.89869 0.48458
magnitude: 1.42167 au
magnitude: 3.61359 debye
