program: Gaussian 09
title: 000030254
version: EM64L-G09RevD.01
frameworkgroup: C1[X(C16H23NO3)]
method: RPBEPBE
basis: SDD
operation: Freq
keyword: #p
keyword: freq=noraman
keyword: PBEPBE/SDD
title: #p freq=noraman PBEPBE/SDD
converged: YES YES NO NO
title: Mulliken charges:
elementType: O O O N C C C C C C C C C C C C C C C C H H H H H H H H H H H H H H H H H H H H H H H
charge: -0.249913 -0.245915 -0.209748 -0.100158 -0.351938 -0.375128 -0.363671 -0.312865 -0.328165 -0.281283 0.256799 0.167036 -0.486126 0.121199 -0.366636 -0.361579 -0.320400 -0.227155 -0.275983 -0.690874 0.201448 0.189361 0.178593 0.315528 0.194412 0.206116 0.187745 0.208399 0.217974 0.189515 0.225876 0.197004 0.234332 0.218369 0.226372 0.213081 0.255327 0.245176 0.230249 0.232767 0.204783 0.223418 0.206660
chargesum: 0.00000
title: Mulliken charges with hydrogens summed into heavy atoms:
elementType: O O O N C C C C C C C C C C C C C C C C
charge: -0.249913 -0.245915 -0.209748 -0.100158 0.038871 0.118993 0.036857 0.083278 0.079324 0.141596 0.256799 0.167036 -0.033426 0.121199 0.072817 -0.106252 -0.075224 0.003095 -0.043215 -0.056013
polarizability: 2.32557695e+02 -4.06050160e+00 2.17036787e+02 -1.70320338e+01 1.48652909e+00 1.28510561e+02
1716.lowfreq: -12.1945 -8.3241 0.0003 0.0005 0.0006 8.4107 18.6970 23.9797 39.4775
frequency: 15.6194 23.1625 39.3529 53.0093 56.9319 77.1436 87.5152 101.6676 119.8727 138.6442 152.2708 215.5485 225.9082 234.6103 250.2282 254.8829 267.6665 280.0033 334.8829 363.6450 383.5581 396.6248 415.0269 424.2555 467.9112 485.2114 502.5539 532.0578 573.8420 585.3561 599.1121 642.0040 727.9902 735.4295 746.5804 755.2863 759.6787 788.7444 802.5862 842.9999 850.6863 868.9972 879.2266 892.2459 918.0185 941.7339 947.2330 980.7541 983.4549 1001.1195 1025.3026 1028.4923 1047.9332 1054.8229 1059.7243 1080.2915 1082.3393 1085.0907 1108.5213 1111.4406 1134.9960 1143.1380 1153.5986 1179.3072 1193.7466 1204.5614 1218.3156 1220.9405 1227.4825 1243.5582 1271.3431 1277.6683 1284.9243 1294.8461 1295.6838 1305.7668 1334.7086 1342.9899 1347.5022 1362.2184 1368.0762 1376.5355 1385.8676 1388.5630 1394.4616 1425.6835 1437.8128 1444.5395 1445.4090 1449.1175 1453.2438 1459.9958 1470.9464 1476.8260 1477.0482 1480.5465 1484.3748 1565.9044 1595.1456 1605.6738 2860.5077 2867.6607 2888.6721 2947.1477 2954.8750 2956.4964 2959.5824 2970.2406 3003.3990 3014.2146 3015.8261 3018.9766 3038.0125 3047.1588 3073.1655 3073.4768 3076.9538 3082.5596 3088.9172 3134.2745 3150.0588 3167.3630 3177.2211
redmass: 3.7801 4.7938 4.5347 1.7646 3.0735 3.4590 4.4824 4.9406 3.5902 3.7303 3.7286 3.6062 1.1101 4.0340 3.4960 2.3113 2.5798 4.5677 2.0321 4.2748 4.4932 2.9925 2.6532 3.5318 2.8225 3.0978 3.3467 4.0615 2.6994 1.9288 4.4201 5.9562 1.6947 2.6213 3.2091 2.1526 1.3745 4.5105 4.0420 1.5987 1.4212 2.8088 1.4976 2.1843 3.0706 1.7301 1.7089 1.3331 3.1000 2.8802 2.1204 2.2342 2.4201 2.0087 2.4717 1.5610 2.2538 3.5038 2.2571 2.3519 1.9721 2.2781 2.8783 1.0858 1.0724 2.3787 1.3657 1.2086 2.9837 1.1937 1.2525 1.3946 1.4527 1.3201 1.2192 1.3114 1.2641 1.2755 1.6487 1.6863 1.3090 1.5562 2.5619 1.2190 1.5014 1.8680 1.1605 1.0846 1.0868 1.1986 1.1015 1.0919 1.0576 1.1392 1.0443 1.9459 1.0765 6.5709 8.3019 6.1615 1.0695 1.0702 1.0690 1.0665 1.0580 1.0623 1.0672 1.0360 1.0629 1.0906 1.0941 1.0885 1.1049 1.0993 1.0991 1.0963 1.1015 1.0904 1.0969 1.0861 1.0896 1.0944 1.0978
irintensity: 1.9229 0.4794 0.1212 0.0148 0.1156 1.4915 0.6387 2.9560 2.2551 0.2626 1.2672 3.4682 0.1477 0.2549 1.2069 9.2625 7.8730 5.6581 6.1035 2.5045 1.4915 1.3754 2.4978 0.3996 0.8562 1.5646 4.6136 1.3190 1.1022 10.0212 6.0473 13.7599 17.0097 6.3828 8.7485 31.5623 56.5367 0.9744 25.6202 1.4500 1.6682 4.8364 2.0325 46.3401 43.2268 22.0819 25.3083 0.8472 26.6210 21.6447 4.7303 11.6849 7.3249 24.8845 5.2042 1.3601 0.4506 58.0786 0.8915 8.3030 53.2643 20.1754 18.3205 10.1151 0.0725 124.3884 3.6852 20.4314 180.6061 21.6075 6.1950 52.7181 29.8859 23.4725 21.0618 10.2668 8.6113 17.3013 16.4226 6.3108 0.9873 5.7058 3.3919 8.7588 3.7783 27.9106 52.6033 5.4368 2.7778 14.7845 15.7277 13.1313 8.7330 14.7090 11.2946 55.4108 12.4807 100.8011 60.4338 149.3570 59.8951 75.0143 111.2328 61.5201 43.4335 17.9648 84.9950 41.7686 18.4024 11.8593 9.3124 80.2969 35.8680 2.2666 44.9805 55.2807 72.0712 30.4510 29.3831 2.8722 12.8341 26.7740 10.9070
temp: 298.150 k
press: 1.00000 atm
elementType: 8 8 8 7 6 6 6 6 6 6 6 6 6 6 6 6 6 6 6 6 1 1 1 1 1 1 1 1 1 1 1 1 1 1 1 1 1 1 1 1 1 1 1
symmnumber: 1
zpe: 952207.3 jmol-1
zpe.correction: 0.362677 hartree
zpe.thermalcorrener: 0.382911 hartree
zpe.thermalcorrenthalpy: 0.383855 hartree
zpe.thermalcorrgfe: 0.311191 hartree
zpe.sumelectzpe: -902.339355 hartree
zpe.sumelectthermal: -902.319121 hartree
zpe.sumelectthermalent: -902.318177 hartree
zpe.sumelectthermalfe: -902.390841 hartree
dipole: 2.7610 -4.2655 1.5056
dipole: 5.2994
quadrupole: -112.1613 -113.8543 -120.5857
quadrupole: 11.3894 -9.0627 0.3692
quadrupole: 3.3724 1.6795 -5.0519 11.3894 -9.0627 0.3692
hfenergy: -902.7020318 hartree
pointgroup: C01 [X(C16H23N1O3)]
dipole: 1.7387705 -1.0438121 0.4839425 debye
polarizability: 233.3513586|6.5813641|216.891843|-10.9941261|8.6208726|127.8618405 unknown
InChI: InChI=1S/C16H23NO3/c1-2-5-15(18)14-6-3-4-7-16(14)20-13-10-17-8-11-19-12-9-17/h3-4,6-7H,2,5,8-13H2,1H3
charge 0 multiplicity 1
43 atoms
O  -5.019248 -0.330317 -1.394851
O  0.215208 -0.97391 0.172234
O  -0.068932 1.730737 -0.167805
N  -2.725116 -1.738932 -0.291213
C  -4.105497 -2.265098 -0.127363
C  -2.756397 -0.248137 -0.358921
C  -1.784069 -2.259637 0.722526
C  -4.97735 -1.796576 -1.30633
C  -3.644069 0.195361 -1.527289
C  -0.337191 -2.345471 0.229369
C  1.534768 -0.801554 -0.229879
C  2.046816 0.542164 -0.263937
C  1.882715 3.044588 0.446354
C  1.185757 1.74746 -0.005317
C  0.899205 4.113952 0.963177
C  2.381826 -1.893388 -0.559576
C  3.418426 0.719534 -0.59508
C  3.729235 -1.67217 -0.908116
C  4.258846 -0.362679 -0.921649
C  1.615253 5.428354 1.338092
H  -4.077152 -3.372202 -0.113611
H  -4.573373 -1.916396 0.828342
H  -3.166946 0.177465 0.591942
H  -1.735584 0.146475 -0.485103
H  -2.089363 -3.294914 0.973974
H  -1.805862 -1.672129 1.673142
H  -4.571044 -2.219776 -2.25129
H  -6.025191 -2.116576 -1.176729
H  -3.749838 1.292095 -1.548455
H  -3.205125 -0.156734 -2.485605
H  -0.312797 -2.798101 -0.780918
H  0.271675 -2.95117 0.933483
H  2.641898 2.806882 1.217668
H  2.446101 3.459917 -0.41713
H  0.130399 4.299557 0.191592
H  0.355138 3.713165 1.839458
H  1.995294 -2.915618 -0.546297
H  3.829452 1.733392 -0.618637
H  4.364862 -2.526804 -1.16552
H  5.305912 -0.188471 -1.188006
H  2.133669 5.865417 0.463117
H  0.895701 6.179764 1.711006
H  2.371789 5.26578 2.12935
