program: Orca
programVersion: 4.2.1
elementType: Cl Cl O O O N N N C C C C C C C C C C C C C C C C C C C H H H H H H H H H H H H H H H H H
charge: 0
multiplicity: 1
keywords: wb97x-d3
keywords: def2-TZVPP
keywords: def2/J RIJCOSX GRIDX6 NOFINALGRIDX
keywords: grid4 nofinalgrid
keywords: scfconv7
keywords: smallprint printgap noloewdin
keywords: NOSOSCF
formula: C19H17Cl2N3O3
InChI: InChI=1S/C19H17Cl2N3O3/c1-13-9-25-19(27-13,10-24-12-22-11-23-24)17-7-6-16(8-18(17)21)26-15-4-2-14(20)3-5-15/h2-8,11-13H,9-10H2,1H3
44 atoms
Cl 2.097753 0.83448 3.100624
Cl -6.616229 1.166542 -2.831185
O  3.354134 0.089262 -1.169934
O  3.823484 1.177921 0.706742
O  -2.476737 0.319118 1.218794
N  2.892321 -2.33651 0.629942
N  2.821329 -2.958153 -0.54968
N  1.369042 -3.862695 0.902057
C  3.11657 0.086848 0.205215
C  3.606081 1.425274 -1.585614
C  3.719135 -1.180386 0.827452
C  3.68247 2.195567 -0.255721
C  1.618109 0.189737 0.484535
C  4.881675 1.466801 -2.399636
C  1.085594 0.515748 1.730531
C  0.71033 -0.11904 -0.523387
C  -0.279612 0.577389 1.948999
C  -0.659471 -0.078425 -0.330767
C  -1.154607 0.281429 0.914257
C  2.009603 -2.881486 1.480995
C  1.89983 -3.865909 -0.339135
C  -3.401034 0.516495 0.232666
C  -3.357246 1.63662 -0.586963
C  -4.429874 -0.402801 0.108264
C  -4.347129 1.833939 -1.534397
C  -5.426789 -0.200598 -0.83313
C  -5.378765 0.914626 -1.65329
H  2.76675 1.786035 -2.191012
H  3.836222 -1.028163 1.899422
H  4.702885 -1.361369 0.395386
H  4.546122 2.858629 -0.190983
H  2.776511 2.786235 -0.078718
H  5.054796 2.472836 -2.783743
H  5.742119 1.180205 -1.793605
H  4.82447 0.790451 -3.251816
H  1.090411 -0.420468 -1.489149
H  -0.668326 0.842594 2.922657
H  -1.323669 -0.341842 -1.142612
H  1.879085 -2.534488 2.495037
H  1.604404 -4.563808 -1.106845
H  -2.558285 2.359779 -0.484824
H  -4.45476 -1.271353 0.752804
H  -4.32004 2.706245 -2.172522
H  -6.233877 -0.913333 -0.929659
totalener: -2044.66713690 hartree
nucrepener: 2762.53894398 hartree
electener: -4807.20608088 hartree
oneelecener: -8295.35042288 hartree
twoeener: 3488.14434199 hartree
kineticenergy: 2038.72082844 hartree
xcener: -149.988117842637 hartree
chargesum: 0.0000000
charge: -0.062836 -0.076787 -0.345956 -0.320097 -0.296428 0.114037 -0.303027 -0.324474 0.598925 0.110481 -0.128364 0.008207 -0.207954 -0.276748 -0.006759 -0.118888 -0.188878 -0.166113 0.240876 0.044806 0.055557 0.231175 -0.166540 -0.197057 -0.110516 -0.094947 0.064938 0.065974 0.130674 0.108000 0.092523 0.079475 0.080834 0.085356 0.098230 0.143439 0.120696 0.134359 0.138931 0.128837 0.134119 0.132701 0.124341 0.124875
qa: -0.0628 -0.0768 -0.3460 -0.3201 -0.2964 0.1140 -0.3030 -0.3245 0.5989 0.1105 -0.1284 0.0082 -0.2080 -0.2767 -0.0068 -0.1189 -0.1889 -0.1661 0.2409 0.0448 0.0556 0.2312 -0.1665 -0.1971 -0.1105 -0.0949 0.0649 0.0660 0.1307 0.1080 0.0925 0.0795 0.0808 0.0854 0.0982 0.1434 0.1207 0.1344 0.1389 0.1288 0.1341 0.1327 0.1243 0.1249
va: 1.2590 1.2278 2.0231 2.0449 2.1134 3.3270 2.8674 3.0649 3.7977 3.8992 3.8740 3.9470 3.6965 3.9740 3.9789 3.9163 4.0924 3.9810 3.8660 4.0720 4.0529 3.8316 3.9860 4.0484 3.9821 3.9654 3.9407 0.9970 1.0100 1.0331 0.9949 0.9994 1.0056 1.0084 1.0075 1.0294 1.0284 1.0070 1.0067 1.0023 1.0028 1.0107 1.0105 1.0091
dispcorr: -0.025416286 hartree
energy: -2044.692553186809
dipole: 23.97294 -23.57306 0.39988 2.02864 -0.68088 1.34776 -8.95725 8.68093 -0.27632
magnitude: 1.43273 au
magnitude: 3.64171 debye
