program: Gaussian 09
title: 000030206
version: EM64L-G09RevD.01
frameworkgroup: C1[X(C14H25N3O)]
method: RPBEPBE
basis: SDD
operation: Freq
keyword: #p
keyword: freq=noraman
keyword: PBEPBE/SDD
title: #p freq=noraman PBEPBE/SDD
converged: YES YES NO NO
title: Mulliken charges:
elementType: O N N N C C C C C C C C C C C C C C H H H H H H H H H H H H H H H H H H H H H H H H H
charge: -0.189361 -0.092556 -0.213990 -0.411457 -0.318606 -0.322157 -0.464565 -0.361028 -0.365201 0.224424 -0.684417 -0.683706 0.389052 0.399670 -0.411803 -0.414887 -0.791939 -0.796554 0.174596 0.200327 0.178739 0.210743 0.178563 0.237050 0.227034 0.191819 0.232159 0.191382 0.308956 0.205490 0.208672 0.223328 0.205220 0.209146 0.223009 0.244824 0.244962 0.215198 0.248919 0.242506 0.250975 0.213057 0.242407
chargesum: 0.00000
title: Mulliken charges with hydrogens summed into heavy atoms:
elementType: O N N N C C C C C C C C C C C C C C
charge: -0.189361 -0.092556 -0.213990 -0.102501 0.056317 0.067325 -0.048952 0.057824 0.058340 0.224424 -0.046926 -0.046332 0.389052 0.399670 -0.166979 -0.169925 -0.085317 -0.090115
polarizability: 2.15913812e+02 -2.95021019e+00 1.85025099e+02 -6.65342000e+00 3.54821921e+00 1.30465886e+02
1716.lowfreq: -6.7062 -3.4648 -0.0004 0.0004 0.0007 1.4832 11.8649 25.4002 27.9750
frequency: 4.4618 25.0046 27.8556 44.8812 57.6253 62.7087 69.7386 74.5280 78.0203 115.9377 132.5124 145.6276 159.2086 175.8746 211.2632 221.3435 225.9596 235.5244 275.7433 278.5718 295.5539 307.3693 312.3335 358.1895 360.3352 442.7860 478.0941 499.3231 516.6859 570.7300 598.1953 607.8378 622.1000 716.3485 723.8818 742.8836 748.7976 765.8023 794.6348 827.7176 835.7622 870.4420 872.5148 897.5165 917.9607 930.8174 960.7637 963.7051 970.2228 1031.3736 1035.8964 1041.6846 1044.0953 1047.9963 1048.7399 1080.9525 1089.2423 1113.8269 1117.8788 1139.1711 1170.6256 1199.1638 1218.8282 1222.7320 1245.7130 1256.7836 1266.7221 1285.7360 1290.6819 1309.4121 1315.9026 1321.0065 1356.5929 1362.7270 1369.5692 1379.3480 1389.6868 1391.8995 1399.1975 1403.9322 1407.6853 1443.2063 1455.7045 1462.2758 1465.4313 1466.8252 1469.7850 1473.0552 1475.9206 1476.8180 1477.3689 1479.1582 1479.3752 1487.6043 1488.7571 1550.4911 1592.7553 1655.4022 2781.2908 2833.5782 2845.8404 2961.8696 2966.0127 2971.6511 2972.8144 2987.0653 2988.2246 3008.9299 3030.8780 3030.9949 3035.3104 3039.1038 3043.7607 3046.7266 3071.5484 3073.0081 3076.8439 3077.0459 3094.9373 3095.6746 3202.8248 3222.6840 3493.4001
redmass: 3.6844 4.0860 3.9275 4.5719 2.2534 2.1302 3.4711 3.2184 1.7330 1.1099 1.5494 1.5496 3.4772 3.2253 1.9646 1.1365 1.4518 1.9921 2.9515 3.2296 3.5128 4.2065 3.4385 2.4632 3.5177 3.0828 2.9249 2.4740 1.6027 3.6034 4.2798 3.8024 2.9624 4.7450 4.6417 1.1087 1.1319 1.2406 4.1315 2.8547 1.3396 1.3549 1.2405 1.5290 2.2522 4.8773 2.1658 1.8243 1.9320 1.2363 2.1974 1.4280 2.8193 2.6795 1.4853 2.1152 2.0275 2.1157 2.1479 2.2124 2.2248 2.0955 1.3951 3.9664 1.2358 1.3786 1.3833 1.1759 1.1503 1.4293 1.9814 2.0140 6.3232 1.4504 1.4068 1.4303 1.2187 1.2293 1.2367 1.3209 3.6469 1.2593 1.2109 1.0599 1.0689 1.0718 1.0771 1.0832 1.0649 1.0999 1.0803 1.1236 1.0458 1.0814 1.0845 5.8640 5.8869 8.4422 1.0716 1.0714 1.0708 1.0391 1.0389 1.0360 1.0358 1.0635 1.0645 1.0840 1.0863 1.0981 1.0979 1.0838 1.0990 1.0969 1.1016 1.1012 1.0988 1.0987 1.0954 1.0957 1.0929 1.1036 1.0782
irintensity: 0.1629 0.0456 1.0495 3.4867 0.6912 0.0567 1.3716 0.9242 0.1611 0.2618 2.3113 2.1642 0.2861 3.9357 0.9400 0.0989 0.3123 2.2465 1.4515 0.1246 1.2232 5.0147 0.4211 4.1362 4.6642 6.7816 2.1111 14.7136 80.1963 17.8423 3.5569 2.4254 1.9467 6.0610 11.5619 5.7133 5.8396 79.1809 0.7512 15.0345 0.0476 1.5037 2.4727 3.9546 1.1221 2.9749 7.0057 8.8976 5.0910 8.3947 0.7515 0.1200 17.0782 3.2292 7.8869 68.2388 39.5477 13.7899 38.2771 56.4775 4.2953 6.4494 4.8174 33.3528 2.3663 9.5272 17.2994 8.3489 5.5059 1.7875 2.6126 8.2504 1.3339 2.2801 2.0926 3.4487 19.8679 15.1879 4.8894 2.4215 37.1453 66.4644 85.0640 3.1821 12.6433 0.0462 3.3648 6.7556 1.4539 4.1809 3.5853 14.7381 13.3928 17.6665 8.4572 7.1845 4.8617 106.8853 129.9234 44.8058 179.2054 61.9753 40.2325 41.2274 41.2827 25.8638 18.8364 35.3332 12.7701 18.3007 25.4294 12.6253 0.4959 4.4154 75.6331 100.5104 26.8890 68.1023 15.7439 26.0864 8.9429 4.7291 15.3039
temp: 298.150 k
press: 1.00000 atm
elementType: 8 7 7 7 6 6 6 6 6 6 6 6 6 6 6 6 6 6 1 1 1 1 1 1 1 1 1 1 1 1 1 1 1 1 1 1 1 1 1 1 1 1 1
symmnumber: 1
zpe: 973990.2 jmol-1
zpe.correction: 0.370973 hartree
zpe.thermalcorrener: 0.392867 hartree
zpe.thermalcorrenthalpy: 0.393811 hartree
zpe.thermalcorrgfe: 0.315692 hartree
zpe.sumelectzpe: -786.499335 hartree
zpe.sumelectthermal: -786.477441 hartree
zpe.sumelectthermalent: -786.476497 hartree
zpe.sumelectthermalfe: -786.554616 hartree
dipole: 2.0677 -0.0908 -4.2750
dipole: 4.7497
quadrupole: -110.5007 -102.9376 -115.5731
quadrupole: 1.0549 0.2486 3.2979
quadrupole: -0.8302 6.7328 -5.9026 1.0549 0.2486 3.2979
hfenergy: -786.8703085 hartree
pointgroup: C01 [X(C14H25N3O1)]
dipole: 0.7797013 -0.0768066 -1.69649 debye
polarizability: 215.4949402|-3.6117808|185.2532384|-8.1869199|2.9501938|130.6566185 unknown
InChI: InChI=1S/C14H25N3O/c1-5-9-16(10-6-2)11-14(18)15-17-12(3)7-8-13(17)4/h7-8,15H,5-6,9-11H2,1-4H3
charge 0 multiplicity 1
43 atoms
O  -0.214401 -0.607479 1.393916
N  2.32007 -0.134277 -0.210638
N  -2.476258 -0.156242 -0.265952
N  -1.187306 -0.422219 -0.7245
C  3.644018 -0.733005 -0.510948
C  2.168315 1.280852 -0.629626
C  1.196257 -0.989581 -0.6121
C  4.056238 -1.835586 0.488635
C  2.91345 2.268945 0.293227
C  -0.106488 -0.650929 0.145013
C  5.440272 -2.432299 0.153186
C  2.7099 3.734727 -0.147365
C  -3.458175 -1.143428 -0.020004
C  -2.962972 1.132358 0.052925
C  -4.58727 -0.459383 0.435009
C  -4.279798 0.95229 0.480843
C  -3.186674 -2.604067 -0.227796
C  -2.105523 2.357787 -0.063455
H  3.68545 -1.142474 -1.554345
H  4.398034 0.074156 -0.465988
H  2.496737 1.437412 -1.690609
H  1.090421 1.532899 -0.593942
H  1.00724 -0.967412 -1.721503
H  1.438499 -2.037051 -0.355408
H  4.054395 -1.399764 1.50461
H  3.300645 -2.645895 0.497869
H  2.544704 2.117467 1.324381
H  3.99609 2.03533 0.306775
H  -1.04229 -0.436535 -1.738104
H  5.449169 -2.884804 -0.856922
H  6.227746 -1.655254 0.179346
H  5.720666 -3.218482 0.876955
H  3.083289 3.901931 -1.175845
H  1.638233 4.011247 -0.129264
H  3.246266 4.429973 0.523085
H  -5.529916 -0.927471 0.715418
H  -4.946298 1.751131 0.80323
H  -2.907225 -2.84193 -1.273037
H  -2.370451 -2.966965 0.426054
H  -4.093344 -3.181976 0.01538
H  -1.227463 2.307058 0.609353
H  -1.73092 2.520647 -1.093441
H  -2.695629 3.244298 0.221282
