program: Gaussian 09
title: 000030217
version: EM64L-G09RevD.01
frameworkgroup: C1[X(C20H23N3)]
method: RPBEPBE
basis: SDD
operation: Freq
keyword: #pfreq=noraman
keyword: PBEPBE/SDD
title: #p freq=noraman PBEPBE/SDD
converged: YES YES NO NO
title: Mulliken charges:
elementType: N N N C C C C C C C C C C C C C C C C C C C C H H H H H H H H H H H H H H H H H H H H H H H
charge: -0.272752 -0.461389 -0.027637 0.057029 0.190818 -0.087940 -0.513600 0.004603 -0.558965 0.216207 0.423358 -0.725233 -0.609799 -0.399216 -0.469387 -0.588027 -0.225082 0.525333 -0.320767 -0.567806 -0.302817 0.152350 -0.773475 0.234640 0.217500 0.219638 0.222180 0.233051 0.245715 0.297281 0.200615 0.244850 0.208517 0.232614 0.229305 0.230788 0.228445 0.226613 0.222135 0.218547 0.237723 0.246883 0.232920 0.225033 0.225954 0.253244
chargesum: 0.00000
title: Mulliken charges with hydrogens summed into heavy atoms:
elementType: N N N C C C C C C C C C C C C C C C C C C C C
charge: -0.027037 -0.164108 -0.027637 0.057029 0.190818 0.146700 -0.076461 0.004603 -0.103733 0.216207 0.423358 -0.071251 -0.147880 -0.168428 -0.240942 -0.139279 -0.006535 0.525333 -0.083044 -0.320924 -0.069897 0.152350 -0.069244
polarizability: 3.09600151e+02 8.31107518e-02 2.80227018e+02 1.65322227e+01 -5.92684821e+00 1.30673057e+02
1716.lowfreq: -23.3609 -5.7662 -0.0005 -0.0005 -0.0002 1.0657 8.6991 17.7723 24.5175
frequency: -23.3241 17.5234 24.4994 38.5475 56.4986 59.9931 85.9855 121.5317 151.0974 156.2016 168.6377 199.1218 227.4493 254.4844 267.0727 284.6650 292.9945 316.5203 339.9871 352.1015 354.7087 378.6939 408.8511 448.2111 476.9841 482.7118 496.2632 506.3497 533.4673 538.2627 559.4662 592.1793 614.5873 631.8313 635.7548 657.0031 666.3683 739.6760 749.3941 754.3367 759.4900 774.8796 780.9857 802.9353 827.6182 828.4255 852.8222 884.7737 898.0964 903.6404 931.0740 934.8571 952.4143 960.2118 973.9701 981.5540 981.9561 998.0770 1007.8842 1041.8275 1048.2983 1063.5732 1071.0889 1088.5991 1105.7163 1129.5709 1137.7274 1144.4391 1153.7855 1171.5507 1176.5229 1215.4130 1221.2719 1241.5762 1247.7656 1255.7935 1264.0666 1268.6542 1277.3206 1295.0329 1298.7524 1312.8599 1314.8004 1325.3130 1336.8509 1344.2889 1349.9038 1374.2336 1387.7385 1389.1657 1400.4493 1426.3982 1444.8740 1451.3265 1454.4336 1455.8671 1461.8699 1470.3952 1472.6181 1474.3899 1476.7871 1481.2526 1487.6961 1498.6756 1554.4930 1576.4887 1591.5903 1594.7278 1624.4569 2940.8037 2952.9283 2973.5245 2980.6826 2981.4238 2986.0667 2998.7129 3001.6211 3025.7599 3034.6152 3058.8398 3061.0203 3065.0433 3096.8569 3107.3726 3115.0053 3115.3214 3116.9339 3129.2787 3145.9628 3154.7910 3407.0571 3603.9705
redmass: 1.0247 4.3344 4.5832 3.9251 3.4938 3.9402 3.7486 3.7839 3.1170 3.9778 3.4397 1.8568 1.3274 2.4840 2.6776 2.7936 3.4322 3.5214 2.9327 4.5012 3.6806 2.6505 3.3012 2.0223 4.3104 3.5417 3.9984 1.2265 3.7725 3.1978 4.4257 3.8799 4.1002 4.0401 7.5598 4.5269 2.1990 3.8089 1.7590 3.4784 3.7636 2.5271 1.2804 3.8074 2.7210 1.9798 2.0013 1.4334 1.7263 2.0035 1.4893 2.4931 1.3685 1.7866 1.4117 1.8071 1.6377 3.7800 3.2092 2.9416 1.5847 2.2175 2.0955 2.0065 3.1230 1.3808 2.0535 1.9163 1.3463 1.1933 1.4486 1.3942 3.0618 1.6861 2.2960 1.4195 1.4966 1.3207 1.8765 1.5947 1.4813 5.4206 1.8366 1.4295 1.8993 1.4067 1.9579 1.9609 1.2428 1.2610 3.5838 2.6437 1.1608 2.9527 1.1797 1.2271 1.3355 1.0479 1.0770 1.1072 1.0625 2.1507 1.1208 3.2567 5.1676 7.0430 6.8269 6.3997 6.6277 1.0604 1.0665 1.0431 1.0822 1.0382 1.0598 1.0597 1.0957 1.0945 1.1003 1.0973 1.1040 1.0973 1.0992 1.0913 1.0870 1.0969 1.0896 1.0902 1.0969 1.0988 1.0741 1.0804
irintensity: 0.4497 0.9608 0.0439 1.3438 0.2843 0.0552 0.2626 0.6053 3.6331 0.7130 0.4107 1.7756 0.8533 8.3863 1.9526 0.6957 4.4117 0.3734 2.8833 2.1065 0.6623 2.5269 4.4597 5.8058 2.3925 4.3584 5.6298 69.6242 3.6266 16.0629 0.2798 7.4150 4.1602 12.4782 2.3572 12.9307 103.0832 0.0609 60.7823 14.6078 20.0778 12.3551 3.8094 15.5196 15.5295 11.5808 9.7595 0.0758 0.6282 1.2229 1.7736 0.8879 1.5848 2.2658 0.1557 7.9252 2.6379 2.4860 7.4976 0.3588 9.3379 4.2743 2.2048 25.3140 13.8020 0.7998 9.8574 3.8310 10.9196 19.7058 4.2904 5.6072 0.3474 3.5901 2.8787 9.4440 5.8906 0.4854 14.0013 3.0637 15.9816 3.7633 13.5275 2.2896 21.6565 6.9066 2.4799 9.0010 21.7621 19.3071 24.1799 36.5809 7.7951 26.4763 6.7128 28.7880 8.1336 14.3204 18.6226 2.0571 3.8982 69.8004 18.5511 4.5216 13.4628 23.0623 6.7655 8.2281 5.9549 64.9079 49.7104 26.9674 17.7268 28.3675 6.4785 54.0975 38.5048 40.0511 0.5021 21.8812 29.4571 52.2930 24.3628 24.9974 9.8023 17.1331 15.5699 16.2310 15.3964 36.0097 1.3104 48.3580
temp: 298.150 k
press: 1.00000 atm
elementType: 7 7 7 6 6 6 6 6 6 6 6 6 6 6 6 6 6 6 6 6 6 6 6 1 1 1 1 1 1 1 1 1 1 1 1 1 1 1 1 1 1 1 1 1 1 1
symmnumber: 1
zpe: 1011930.5 jmol-1
zpe.correction: 0.385424 hartree
zpe.thermalcorrener: 0.405505 hartree
zpe.thermalcorrenthalpy: 0.406449 hartree
zpe.thermalcorrgfe: 0.335035 hartree
zpe.sumelectzpe: -938.536729 hartree
zpe.sumelectthermal: -938.516648 hartree
zpe.sumelectthermalent: -938.515704 hartree
zpe.sumelectthermalfe: -938.587118 hartree
dipole: -4.7145 -1.7227 -0.5997
dipole: 5.0551
quadrupole: -125.7650 -132.7209 -140.0013
quadrupole: -7.6995 7.0655 -0.1094
quadrupole: 7.0640 0.1082 -7.1722 -7.6995 7.0655 -0.1094
hfenergy: -938.9221531 hartree
pointgroup: C01 [X(C20H23N3)]
dipole: -1.8267522 0.7461682 0.2481807 debye
polarizability: 309.4249956|-1.0930905|280.3456963|-17.4149046|-4.1883623|130.7295345 unknown
InChI: InChI=1S/C20H23N3/c1-13-6-7-15(11-21-13)8-9-16-4-3-5-18-20(16)17-12-22-14(2)10-19(17)23-18/h3-7,11,14,22-23H,8-10,12H2,1-2H3
charge 0 multiplicity 1
46 atoms
N  -1.828828 2.890135 0.130778
N  -3.968912 -0.726393 0.299361
N  5.365046 -0.605949 0.281478
C  -2.030379 0.405221 -0.115089
C  -3.390431 0.545884 0.165297
C  -3.253333 3.001509 -0.280568
C  -4.13957 1.843811 0.296177
C  -1.743017 -1.022131 -0.171752
C  -1.16537 1.637866 -0.328139
C  -2.987899 -1.704816 0.09655
C  -0.572138 -1.800881 -0.428685
C  -3.802507 4.381078 0.117492
C  0.78976 -1.168584 -0.67153
C  -3.104484 -3.110401 0.121344
C  -0.700826 -3.208146 -0.408819
C  1.552588 -0.868539 0.662608
C  -1.938234 -3.857185 -0.137793
C  2.927646 -0.271446 0.427457
C  3.112276 1.093339 0.082108
C  4.099391 -1.064118 0.511595
C  4.409807 1.587782 -0.156176
C  5.525417 0.713224 -0.052406
C  6.940579 1.195757 -0.299207
H  -3.264594 2.910492 -1.385709
H  -5.105906 1.809409 -0.248309
H  -4.380433 2.062957 1.358948
H  -0.201081 1.553508 0.20683
H  -0.918585 1.75629 -1.403656
H  -1.742313 3.001146 1.152944
H  -4.950599 -0.907626 0.497269
H  -3.742685 4.526221 1.214236
H  -3.215082 5.180499 -0.364621
H  -4.861943 4.489457 -0.179175
H  1.417543 -1.84808 -1.278131
H  0.695197 -0.22871 -1.246427
H  -4.060081 -3.605904 0.326598
H  0.18604 -3.820851 -0.613878
H  1.642071 -1.813657 1.230658
H  0.934834 -0.187671 1.279674
H  -1.983764 -4.951881 -0.136199
H  2.247206 1.764159 0.006114
H  4.023825 -2.125929 0.781597
H  4.568382 2.639529 -0.418594
H  7.050503 1.621316 -1.31426
H  7.227479 1.985908 0.420118
H  7.638902 0.351502 -0.191208
