program: Gaussian 09
title: 000030198
version: EM64L-G09RevD.01
frameworkgroup: C1[X(C6H10N4O13)]
method: RPBEPBE
basis: SDD
operation: Freq
keyword: #p
keyword: freq=noraman
keyword: PBEPBE/SDD
title: #p freq=noraman PBEPBE/SDD
converged: YES YES NO NO
title: Mulliken charges:
elementType: O O O O O O O O O O O O O N N N N C C C C C C H H H H H H H H H H
charge: -0.313590 -0.186360 -0.186359 -0.195350 -0.195347 -0.144094 -0.144095 -0.108263 -0.108263 -0.139718 -0.139719 -0.119634 -0.119636 0.205590 0.205590 0.213370 0.213369 -0.087669 -0.087670 -0.248319 -0.248321 -0.285701 -0.285701 0.265716 0.265715 0.238986 0.227560 0.238987 0.227559 0.259423 0.261258 0.259426 0.261256
chargesum: 0.00000
title: Mulliken charges with hydrogens summed into heavy atoms:
elementType: O O O O O O O O O O O O O N N N N C C C C C C
charge: -0.313590 -0.186360 -0.186359 -0.195350 -0.195347 -0.144094 -0.144095 -0.108263 -0.108263 -0.139718 -0.139719 -0.119634 -0.119636 0.205590 0.205590 0.213370 0.213369 0.178048 0.178045 0.218227 0.218226 0.234980 0.234982
polarizability: 1.52283148e+02 -2.83427517e+00 2.13313404e+02 -1.82340514e-03 -2.61576914e-04 1.28395385e+02
1716.lowfreq: -5.7667 -3.0025 -0.0012 -0.0011 -0.0011 4.3370 8.2413 8.5020 18.0904
frequency: 8.1631 8.4017 18.0693 29.1933 33.5353 34.4026 44.0195 48.0032 51.8763 59.5154 72.8608 97.7046 109.9895 133.0551 139.5020 169.0967 177.7814 191.4357 202.1569 218.5776 227.5082 234.4068 265.6252 299.7393 357.5241 399.6357 427.4358 467.9163 470.5313 519.5757 527.3470 537.3384 582.0632 597.8191 599.4461 631.9752 632.1918 639.3709 639.4103 683.3028 685.0919 743.3289 743.4913 757.3079 760.7413 849.6496 851.2617 897.4155 905.9863 914.5743 918.1885 931.1010 1012.9626 1023.5911 1056.5835 1068.4996 1086.9396 1133.3231 1150.6212 1157.5119 1159.3768 1169.7551 1172.2713 1188.2692 1197.1191 1232.1121 1234.5468 1285.7046 1294.3891 1323.2309 1323.4645 1340.8096 1347.2959 1363.6539 1408.2568 1444.2107 1445.0002 1471.3497 1484.9105 1531.0566 1531.5528 1538.0054 1539.0189 2974.7943 2978.7825 3021.4416 3021.5285 3030.1059 3030.8347 3044.0101 3047.5463 3099.6151 3099.6707
redmass: 12.7855 13.2089 13.9856 12.6304 12.1703 10.1456 12.8677 10.2642 13.3259 10.1041 10.0048 7.6322 9.8970 5.9330 5.8736 3.8747 4.4717 12.9443 8.3640 5.2298 4.3982 3.3972 8.6502 2.8373 3.6515 8.8785 4.6134 6.4880 7.0890 5.8466 4.3869 7.0109 5.8460 11.8268 12.2994 14.1110 13.8575 14.1083 14.1163 5.3533 4.9494 11.3161 12.0343 13.2348 13.9086 3.1923 3.0825 3.0494 3.5246 2.7834 2.9928 5.1826 2.9338 2.8811 6.4477 1.9592 2.0773 2.3213 2.2288 5.9454 7.2553 7.3424 4.2891 1.3542 1.2363 1.1582 1.1586 1.1958 1.2588 1.6275 1.5622 1.3141 1.2991 1.3242 1.4417 1.0779 1.0784 1.0886 1.0824 13.7531 13.7533 13.0273 12.8433 1.0566 1.0564 1.0695 1.0709 1.0730 1.0726 1.1015 1.1047 1.1084 1.1084
irintensity: 0.1751 0.5932 0.0262 0.4694 0.1402 1.4955 0.2572 2.5252 0.5496 1.1052 0.1846 0.2722 3.8671 0.1093 5.6996 5.8143 0.3701 0.0028 1.7833 9.6724 0.2873 20.3628 0.5264 1.1289 8.3562 1.5348 5.1933 35.8476 5.1404 35.0352 4.1996 2.3555 6.3160 17.1557 0.0023 7.8267 4.5993 0.0238 11.6242 11.6110 0.3676 26.6352 585.2575 483.2581 15.0873 29.9911 7.0274 44.0430 0.0543 0.7595 59.2725 14.2238 39.4709 0.0041 268.0605 5.9262 8.7679 15.6997 0.0170 53.3594 822.1016 30.2688 32.3898 0.1244 48.2387 20.2172 0.1481 0.9253 1.8808 1.1492 1.9926 3.8018 4.7912 4.8941 0.0089 26.9878 10.4291 30.3760 8.1028 122.9651 296.2531 377.9496 140.7858 20.9399 37.9480 0.0127 19.8985 2.8377 14.2101 27.2978 3.5940 16.2635 0.4838
temp: 298.150 k
press: 1.00000 atm
elementType: 8 8 8 8 8 8 8 8 8 8 8 8 8 7 7 7 7 6 6 6 6 6 6 1 1 1 1 1 1 1 1 1 1
symmnumber: 1
zpe: 547945.7 jmol-1
zpe.correction: 0.208701 hartree
zpe.thermalcorrener: 0.233166 hartree
zpe.thermalcorrenthalpy: 0.234110 hartree
zpe.thermalcorrgfe: 0.145437 hartree
zpe.sumelectzpe: -1429.231779 hartree
zpe.sumelectthermal: -1429.207314 hartree
zpe.sumelectthermalent: -1429.206370 hartree
zpe.sumelectthermalfe: -1429.295043 hartree
dipole: 0.0001 -0.0001 2.3426
dipole: 2.3426
quadrupole: -156.1631 -159.3678 -129.8059
quadrupole: 7.6571 0.0016 -0.0001
quadrupole: -7.7175 -10.9222 18.6397 7.6571 0.0016 -0.0001
hfenergy: -1429.4404802 hartree
pointgroup: C01 [X(C6H10N4O13)]
dipole: 0.0000455 0.0000208 -0.9216609 debye
polarizability: 152.5787966|5.0979613|213.017756|0.0018124|-0.0003293|128.3953847 unknown
InChI: InChI=1S/C6H10N4O13/c11-7(12)20-3-5(22-9(15)16)1-19-2-6(23-10(17)18)4-21-8(13)14/h5-6H,1-4H2
charge 0 multiplicity 1
33 atoms
O  0.000109 0.000048 -0.035804
O  -3.348901 1.514387 0.518099
O  3.348978 -1.514508 0.518351
O  -3.187467 -1.30255 0.038993
O  3.187761 1.302438 0.03927
O  -2.177286 3.576753 0.137082
O  2.177257 -3.576799 0.137247
O  -4.164851 3.545973 1.283321
O  4.16474 -3.546147 1.283631
O  -3.700465 -2.623979 -1.874539
O  3.700699 2.623983 -1.874198
O  -4.021914 -3.451371 0.243864
O  4.022123 3.451281 0.244245
N  -3.204918 3.044557 0.656453
N  3.204886 -3.044668 0.656693
N  -3.68756 -2.592414 -0.60608
N  3.687798 2.592353 -0.605741
C  -2.211421 0.893281 -0.215397
C  2.211592 -0.893326 -0.215228
C  -1.096316 0.534623 0.78095
C  1.09643 -0.534611 0.781032
C  -2.785917 -0.299728 -0.980878
C  2.786223 0.299658 -0.980648
H  -1.81948 1.615931 -0.956587
H  1.819668 -1.615944 -0.956459
H  -1.455104 -0.221499 1.506155
H  -0.763964 1.443003 1.322539
H  1.455208 0.221478 1.506277
H  0.763973 -1.442977 1.322581
H  -2.00247 -0.722734 -1.633475
H  -3.66216 -0.00007 -1.580723
H  2.002853 0.722724 -1.633299
H  3.662494 -0.000045 -1.580429
