program: Orca
programVersion: 4.2.1
elementType: Cl Cl O O O N N N C C C C C C C C C C C C C C C C C C C H H H H H H H H H H H H H H H H H
charge: 0
multiplicity: 1
keywords: wb97x-d3
keywords: def2-TZVPP
keywords: def2/J RIJCOSX GRIDX6 NOFINALGRIDX
keywords: grid4 nofinalgrid
keywords: scfconv7
keywords: smallprint printgap noloewdin
keywords: NOSOSCF
formula: C19H17Cl2N3O3
InChI: InChI=1S/C19H17Cl2N3O3/c1-13-9-25-19(27-13,10-24-12-22-11-23-24)17-7-6-16(8-18(17)21)26-15-4-2-14(20)3-5-15/h2-8,11-13H,9-10H2,1H3
44 atoms
Cl 0.122992 1.649403 -1.350526
Cl -7.666943 -0.211207 -0.522237
O  3.586769 -0.443066 0.653263
O  2.959987 0.836585 -1.067311
O  -2.325746 -2.510612 0.183649
N  3.713293 2.321226 1.226332
N  3.967548 3.368477 0.438189
N  5.776636 2.846681 1.660795
C  2.56667 0.405139 0.199099
C  4.39048 -0.861343 -0.454497
C  2.473397 1.594832 1.156404
C  3.662756 -0.247052 -1.644063
C  1.233861 -0.340802 0.163146
C  4.515187 -2.364114 -0.51354
C  0.10669 0.138878 -0.500148
C  1.092683 -1.548666 0.842701
C  -1.095376 -0.55302 -0.513656
C  -0.096612 -2.252631 0.861699
C  -1.192704 -1.752374 0.175657
C  4.800587 2.017466 1.936154
C  5.208143 3.645732 0.738409
C  -3.553511 -1.918573 0.010634
C  -3.954278 -0.840125 0.787831
C  -4.41021 -2.475615 -0.924536
C  -5.222801 -0.310179 0.618566
C  -5.68523 -1.954635 -1.085246
C  -6.079125 -0.871538 -0.316811
H  5.38115 -0.410671 -0.33699
H  2.222512 1.228861 2.151546
H  1.689697 2.285462 0.854354
H  4.33651 0.135048 -2.409015
H  2.975791 -0.963706 -2.111551
H  4.984895 -2.760958 0.386287
H  5.141369 -2.645774 -1.361073
H  3.543493 -2.843994 -0.638582
H  1.935028 -1.953659 1.384368
H  -1.93526 -0.151778 -1.064548
H  -0.170677 -3.186652 1.402308
H  4.830942 1.210556 2.650186
H  5.728298 4.469943 0.27622
H  -3.293012 -0.409115 1.528547
H  -4.090781 -3.318346 -1.52316
H  -5.536973 0.530172 1.221837
H  -6.35585 -2.390847 -1.812521
elementType: Cl O N C H
totalener: -2044.68948731 hartree
nucrepener: 2708.23716367 hartree
electener: -4752.92665098 hartree
oneelecener: -8187.03572407 hartree
twoeener: 3434.10907308 hartree
cpcmener: -0.03528266 hartree
kineticenergy: 2038.71933712 hartree
xcener: -149.991114823596 hartree
chargesum: -0.0000000
charge: -0.079803 -0.099715 -0.412087 -0.361748 -0.329940 0.124012 -0.354608 -0.421694 0.575116 0.133859 -0.097340 0.022122 -0.143302 -0.283030 0.001008 -0.128323 -0.169490 -0.270564 0.283746 0.060296 0.058101 0.274358 -0.195415 -0.242917 -0.127260 -0.111942 0.070047 0.080849 0.141450 0.133352 0.118038 0.081719 0.097597 0.104807 0.082258 0.156712 0.131317 0.151358 0.171470 0.161523 0.163219 0.153102 0.149234 0.148505
qa: -0.0798 -0.0997 -0.4121 -0.3617 -0.3299 0.1240 -0.3546 -0.4217 0.5751 0.1339 -0.0973 0.0221 -0.1433 -0.2830 0.0010 -0.1283 -0.1695 -0.2706 0.2837 0.0603 0.0581 0.2744 -0.1954 -0.2429 -0.1273 -0.1119 0.0700 0.0808 0.1415 0.1334 0.1180 0.0817 0.0976 0.1048 0.0823 0.1567 0.1313 0.1514 0.1715 0.1615 0.1632 0.1531 0.1492 0.1485
va: 1.2435 1.2036 1.9654 1.9990 2.0791 3.3778 2.8912 3.0250 3.8828 3.9143 3.7792 3.9096 3.5796 3.9684 4.0150 3.9166 3.9766 4.0815 3.7780 4.0637 4.0542 3.6892 3.9655 4.0444 3.9572 3.9451 3.8373 1.0028 1.0054 1.0317 0.9968 1.0053 1.0041 1.0050 1.0032 1.0182 1.0247 1.0077 1.0029 0.9953 0.9918 1.0038 1.0021 1.0010
dispcorr: -0.024345531 hartree
energy: -2044.713832842775
dipole: 30.48288 -30.84687 -0.36400 -12.38092 9.95761 -2.42332 3.23507 -3.02965 0.20542
magnitude: 2.45910 au
magnitude: 6.25053 debye
