program: Gaussian 09
title: 000030144
version: EM64L-G09RevD.01
frameworkgroup: C1[X(C6H2Cl3NO3)]
method: RPBEPBE
basis: SDD
operation: Freq
keyword: #p
keyword: freq=noraman
keyword: PBEPBE/SDD
title: #p freq=noraman PBEPBE/SDD
converged: NO NO NO NO
title: Mulliken charges:
elementType: Cl Cl Cl O O O N C C C C C C H H
charge: 0.102182 0.018068 0.038671 -0.357072 -0.201390 -0.175137 0.011869 0.574660 -0.373428 -0.399774 0.524461 -0.181753 -0.276083 0.321278 0.373447
chargesum: 0.00000
title: Mulliken charges with hydrogens summed into heavy atoms:
elementType: Cl Cl Cl O O O N C C C C C C
charge: 0.102182 0.018068 0.038671 0.016374 -0.201390 -0.175137 0.011869 0.574660 -0.373428 -0.078496 0.524461 -0.181753 -0.276083
polarizability: 1.67915849e+02 -1.18960580e+00 1.52527271e+02 -1.06866896e-03 6.19205118e-03 3.96784685e+01
1716.lowfreq: -28.1950 -0.5901 0.0027 0.0029 0.0032 0.3257 6.2750 59.6560 103.3927
frequency: -28.0627 59.6553 103.3918 134.6373 172.1298 198.4776 230.5721 272.0684 291.2819 308.6559 336.8252 340.3944 363.7707 403.7551 493.4239 508.0345 588.8224 591.7765 619.6290 660.7975 699.9571 734.0351 763.2076 787.3631 920.8625 926.2563 1073.7559 1131.9843 1168.8990 1184.2284 1287.9223 1342.2845 1387.3970 1397.0520 1444.0204 1561.7340 1584.4715 3184.3576 3469.8092
redmass: 16.4735 22.9253 12.6662 9.5576 20.3452 23.9991 26.1779 7.7088 9.9523 13.5029 21.9179 9.9827 16.9180 10.5835 1.5586 2.1470 9.8834 11.9440 6.0258 13.2971 11.1408 7.2800 9.3825 12.2454 9.8221 1.3903 6.6697 1.8830 2.2747 9.2787 1.9595 8.8356 9.9963 9.2715 5.3514 7.1240 9.8519 1.0920 1.0647
irintensity: 0.0076 0.1872 0.0554 0.9219 1.0932 0.1153 0.1027 0.7282 3.8337 2.0911 0.7081 5.1248 1.6445 3.7748 96.9649 55.1638 25.8813 2.5993 19.5536 42.2735 2.9498 2.6993 43.9522 5.0367 38.1085 20.8821 61.0538 9.8418 490.6427 216.2933 39.5651 41.1927 60.4298 98.1720 127.9918 1.1556 79.7834 17.6390 102.3078
temp: 298.150 k
press: 1.00000 atm
elementType: 17 17 17 8 8 8 7 6 6 6 6 6 6 1 1
symmnumber: 1
zpe: 195755.1 jmol-1
zpe.correction: 0.074559 hartree
zpe.thermalcorrener: 0.085662 hartree
zpe.thermalcorrenthalpy: 0.086606 hartree
zpe.thermalcorrgfe: 0.036361 hartree
zpe.sumelectzpe: -1889.393828 hartree
zpe.sumelectthermal: -1889.382726 hartree
zpe.sumelectthermalent: -1889.381781 hartree
zpe.sumelectthermalfe: -1889.432026 hartree
dipole: 2.9793 3.3394 0.0009
dipole: 4.4753
quadrupole: -106.9838 -94.3068 -93.3306
quadrupole: -2.6772 -0.0004 -0.0058
quadrupole: -8.7767 3.9003 4.8764 -2.6772 -0.0004 -0.0058
hfenergy: -1889.4683873 hartree
pointgroup: C01 [X(C6H2Cl3N1O3)]
dipole: 1.6160889 0.6988105 0.0003704 debye
dipolederiv: -0.106267 0.2626578 -0.0000528 0.2453861 -0.4417383 0.0000515 -0.000095 0.0000854 0.0428974 -0.2297527 -0.2439525 0.0000177 -0.2358276 -0.5162011 0.0000421 0.0000106 0.0000925 0.0016653 -0.2812699 0.2998268 -0.0000112 0.3596966 -0.4873823 0.0000169 -0.0000043 -0.0000122 -0.005101 -1.4580364 -0.2394288 0.0000021 -0.2525526 -0.1623049 -0.0000027 0.0000581 0.0000046 -0.3601507 -0.6377969 -0.2265645 -0.0000577 -0.2779694 -0.7819013 -0.0002581 -0.0002656 -0.0006477 -0.2251279 -0.810718 0.10731 0.0003103 0.1933595 -0.4697199 -0.0004659 -0.0000642 -0.0001529 -0.1990172 1.9439142 0.378765 -0.0001629 0.2255353 1.0966309 0.0008838 0.0000928 0.0007774 0.1899237 -0.9648685 -0.2167661 -0.000075 -0.1435093 -0.2278656 -0.0001226 0.0001142 0.0000541 0.0829436 0.5159064 -0.3412774 0.0000645 -0.1863682 0.6719381 -0.0000934 0.0002962 -0.0001078 -0.0296736 0.1890879 0.1657054 0.0000199 -0.0816529 -0.2301644 -0.0000186 -0.0001029 0.0000002 -0.0526622 1.2930777 0.244807 -0.0000057 0.2188588 -0.127977 0.0000279 -0.0000384 -0.0000174 0.1569003 -0.2655733 0.3847623 -0.0000582 0.7844447 0.6435643 -0.0000673 -0.0000803 -0.0001036 -0.0653448 0.1601255 -0.5998526 -0.0000022 -0.9257088 0.7109789 -0.0000265 0.000017 0.0000498 -0.0931261 0.1615937 -0.0178356 0.0000053 0.0297187 0.112438 0.0000259 0.0000546 -0.000027 0.1765432 0.4905776 0.0418433 0.000006 0.0465892 0.2097046 0.000007 0.0000072 0.0000046 0.37933 unknown
polarizability: 164.2844181|-6.641568|156.1587021|0.0016354|0.006067|39.6784685 unknown
InChI: InChI=1S/C6H2Cl3NO3/c7-2-1-3(10(12)13)4(8)5(9)6(2)11/h1,11H
charge 0 multiplicity 1
15 atoms
Cl -1.426888 2.529175 -0.000172
Cl 1.75396 2.802454 -0.000213
Cl 2.352942 -2.683855 0.000107
O  3.215073 0.167142 -0.000007
O  -2.762336 -1.858462 -0.001131
O  -3.291343 0.353569 0.000583
N  -2.43561 -0.605756 0.000308
C  -0.977709 -0.290471 0.000148
C  -0.442181 1.027601 0.000061
C  -0.114558 -1.412721 0.000142
C  1.843669 0.050398 0.000046
C  0.962229 1.164638 0.000002
C  1.269831 -1.247708 0.000118
H  -0.569754 -2.406121 0.000174
H  3.488274 1.125518 -0.000066
