program: Orca
programVersion: 4.2.1
elementType: Cl Cl O O O N N N C C C C C C C C C C C C C C C C C C C H H H H H H H H H H H H H H H H H
charge: 0
multiplicity: 1
keywords: wb97x-d3
keywords: def2-TZVPP
keywords: def2/J RIJCOSX GRIDX6 NOFINALGRIDX
keywords: grid4 nofinalgrid
keywords: scfconv7
keywords: smallprint printgap noloewdin
keywords: NOSOSCF
formula: C19H17Cl2N3O3
InChI: InChI=1S/C19H17Cl2N3O3/c1-13-9-25-19(27-13,10-24-12-22-11-23-24)17-7-6-16(8-18(17)21)26-15-4-2-14(20)3-5-15/h2-8,11-13H,9-10H2,1H3
44 atoms
Cl 2.545621 0.170528 -2.921977
Cl -6.784624 0.628086 1.34429
O  3.43574 -0.50859 1.449505
O  4.268118 -0.549224 -0.619536
O  -2.059642 -1.224915 -1.5840
N  2.191247 2.105286 0.767939
N  1.166756 2.54826 0.032901
N  0.644415 2.59501 2.214777
C  3.225059 -0.031312 0.147777
C  4.236542 -1.695088 1.389017
C  3.347128 1.498417 0.156585
C  4.5059 -1.847413 -0.107424
C  1.845184 -0.451978 -0.351966
C  3.539341 -2.881696 2.010053
C  1.449106 -0.343316 -1.682268
C  0.872375 -0.840765 0.565269
C  0.14742 -0.597185 -2.083714
C  -0.43347 -1.102753 0.194552
C  -0.792046 -0.967371 -1.137366
C  1.858042 2.125718 2.060212
C  0.272245 2.830621 0.942178
C  -3.128971 -0.765617 -0.859432
C  -4.265221 -1.560284 -0.838467
C  -3.11584 0.464074 -0.212902
C  -5.397358 -1.127435 -0.166828
C  -4.244128 0.891944 0.468304
C  -5.376727 0.093101 0.488735
H  5.166567 -1.492038 1.927243
H  3.427065 1.884858 -0.856497
H  4.244669 1.790534 0.701223
H  5.532564 -2.132319 -0.330856
H  3.83303 -2.581867 -0.56647
H  4.185932 -3.75805 1.9457
H  2.605272 -3.115539 1.49726
H  3.32367 -2.710395 3.064576
H  1.133965 -0.934827 1.609134
H  -0.139561 -0.49702 -3.121902
H  -1.153634 -1.403356 0.943876
H  2.526065 1.812794 2.846371
H  -0.687339 3.247043 0.677932
H  -4.270703 -2.515258 -1.347214
H  -2.237754 1.097486 -0.234173
H  -6.2822 -1.748616 -0.151938
H  -4.234505 1.848455 0.972482
elementType: Cl O N C H
totalener: -2044.68605718 hartree
nucrepener: 2811.20506565 hartree
electener: -4855.89112283 hartree
oneelecener: -8393.49731319 hartree
twoeener: 3537.60619035 hartree
cpcmener: -0.03112484 hartree
kineticenergy: 2038.71291127 hartree
xcener: -149.991371543478 hartree
chargesum: 0.0000000
charge: -0.080766 -0.101636 -0.403398 -0.369329 -0.335208 0.114069 -0.333309 -0.403392 0.598173 0.134929 -0.093354 0.004560 -0.143192 -0.290991 0.052600 -0.160690 -0.227102 -0.222797 0.267705 0.055841 0.051872 0.268416 -0.243538 -0.165379 -0.116212 -0.145771 0.075224 0.083224 0.130039 0.131647 0.118690 0.084154 0.106764 0.084205 0.098887 0.163233 0.127994 0.156429 0.170641 0.161048 0.152727 0.151553 0.147645 0.143795
qa: -0.0808 -0.1016 -0.4034 -0.3693 -0.3352 0.1141 -0.3333 -0.4034 0.5982 0.1349 -0.0934 0.0046 -0.1432 -0.2910 0.0526 -0.1607 -0.2271 -0.2228 0.2677 0.0558 0.0519 0.2684 -0.2435 -0.1654 -0.1162 -0.1458 0.0752 0.0832 0.1300 0.1316 0.1187 0.0842 0.1068 0.0842 0.0989 0.1632 0.1280 0.1564 0.1706 0.1610 0.1527 0.1516 0.1476 0.1438
va: 1.2404 1.2020 1.9716 2.0066 2.0704 3.3631 2.8820 3.0259 3.8389 3.9293 3.8380 3.9387 3.5827 3.9502 3.9279 3.8364 4.1691 4.0327 3.7696 4.0725 4.0466 3.7259 4.0266 3.9251 3.9591 3.9943 3.8343 1.0021 1.0256 1.0184 0.9946 1.0032 1.0064 1.0013 1.0042 1.0125 1.0273 0.9973 1.0081 0.9960 1.0046 0.9990 1.0011 1.0064
dispcorr: -0.027001594 hartree
energy: -2044.713058772770
dipole: 21.85974 -20.00634 1.85340 -11.78611 9.94489 -1.84122 11.24894 -10.68181 0.56713
magnitude: 2.67335 au
magnitude: 6.79512 debye
