program: Gaussian 09
title: 000030142
version: EM64L-G09RevD.01
frameworkgroup: C1[X(C10H24N)]
method: RPBEPBE
basis: SDD
operation: Freq
keyword: #p
keyword: freq=noraman
keyword: PBEPBE/SDD
title: #p freq=noraman PBEPBE/SDD
converged: YES YES NO NO
title: Mulliken charges:
elementType: N C C C C C C C C C C H H H H H H H H H H H H H H H H H H H H H H H H
charge: -0.110440 -0.352445 -0.410970 -0.371665 -0.554933 -0.544059 -0.555284 -0.374997 -0.354257 -0.356286 -0.686410 0.267855 0.268052 0.230146 0.230899 0.208290 0.208209 0.198838 0.199262 0.275374 0.269818 0.262067 0.265182 0.269298 0.269221 0.269903 0.275983 0.261866 0.195086 0.195211 0.198677 0.198871 0.228893 0.212318 0.212428
chargesum: 1.00000
title: Mulliken charges with hydrogens summed into heavy atoms:
elementType: N C C C C C C C C C C
charge: -0.110440 0.183462 0.050076 0.044833 0.252325 0.259643 0.252467 0.023102 0.036040 0.041262 -0.032771
polarizability: 1.44756068e+02 -1.96394622e-02 1.00294429e+02 2.12579713e-02 2.01910563e-03 9.77265166e+01
1716.lowfreq: -4.4011 -0.0010 -0.0009 -0.0007 8.5516 16.0774 38.4596 49.6430 57.2303
frequency: 38.0366 46.3839 57.2073 82.7557 91.3427 130.0782 144.4980 154.0720 194.6407 206.8375 223.8746 248.3403 259.7755 273.5207 338.9342 356.4979 401.6733 421.9727 428.0426 485.2170 512.1645 727.8023 728.7120 740.0150 767.1948 827.6579 858.1980 891.9867 908.7813 938.6169 939.9841 1001.0539 1005.9531 1019.9349 1040.3668 1053.1024 1066.5393 1078.3882 1078.8288 1102.1593 1129.1967 1151.6469 1190.1673 1214.1606 1226.3467 1238.1302 1246.0791 1261.5128 1283.5624 1288.4451 1295.2074 1304.5831 1320.7971 1324.5058 1348.5493 1355.6816 1366.7648 1394.4128 1418.6797 1419.7585 1443.8976 1451.4810 1455.9117 1464.5166 1465.2056 1466.2735 1468.8423 1471.4575 1477.0713 1478.0176 1483.2843 1484.1396 1485.4782 1490.2336 1500.0341 2958.5187 2962.4387 2970.1162 2974.9335 2979.3811 2995.0403 2996.1309 3009.3002 3012.8702 3023.3297 3025.7490 3027.6039 3030.9380 3042.3221 3059.3897 3074.6763 3082.9765 3090.3568 3139.9001 3140.0344 3144.5920 3145.8549 3153.9887 3157.5805
redmass: 3.0487 1.6813 3.3354 1.6367 2.1671 1.6381 2.0280 3.1346 1.2841 3.3257 1.1363 1.0968 1.0636 2.7434 2.2111 2.6142 3.1657 2.6432 2.2639 2.7139 2.8200 1.0659 4.2126 1.0863 1.1461 1.2356 3.4039 1.9029 1.5577 2.6963 1.7880 4.3112 1.1634 3.4539 1.1962 2.6709 2.6093 1.2089 2.2111 1.6008 2.2691 1.4259 1.6903 1.5414 1.5805 1.4665 1.8485 1.3969 1.3222 1.0404 1.1801 1.0859 1.2286 1.3397 1.4571 1.5892 1.3224 1.2115 1.1470 1.1439 1.1024 1.0471 1.1121 1.0691 1.0791 1.0411 1.0513 1.0730 1.0723 1.0420 1.0702 1.0553 1.0779 1.0949 1.0600 1.0590 1.0590 1.0593 1.0591 1.0363 1.0585 1.0980 1.1009 1.0578 1.0322 1.0985 1.0368 1.0337 1.1045 1.1050 1.1008 1.0992 1.1080 1.1055 1.1057 1.1051 1.1052 1.1050 1.1045
irintensity: 0.1651 0.0052 0.3224 0.1885 0.0036 0.0093 0.0092 0.4157 0.2049 1.7719 0.0000 0.4023 0.0186 0.1833 0.2071 0.1647 0.0051 0.6290 0.1242 0.0576 2.2827 13.2367 0.0668 1.4965 6.0412 0.0560 52.4922 5.0513 9.1278 14.8901 5.9185 5.3140 0.9603 1.7729 0.0150 10.1001 2.0186 0.0158 0.5919 18.7071 2.3821 0.0516 0.1426 4.4768 0.0287 7.0492 0.0427 0.0703 4.2651 3.1250 0.1023 0.0016 0.1042 3.9523 4.7546 0.5897 4.4864 10.9068 17.3196 18.2749 2.0001 0.0483 9.2117 0.1722 1.4047 0.7344 1.6798 0.7445 4.4459 14.7241 26.8439 42.7732 28.9571 27.3996 85.7911 1.0756 2.6996 1.1866 101.3048 37.3629 23.9185 0.0295 0.0890 15.5833 4.9092 0.0849 4.1106 2.5910 48.4861 39.4497 81.2272 40.5314 27.1745 0.6450 0.1726 4.2818 10.9270 0.8510 6.3050
temp: 298.150 k
press: 1.00000 atm
elementType: 7 6 6 6 6 6 6 6 6 6 6 1 1 1 1 1 1 1 1 1 1 1 1 1 1 1 1 1 1 1 1 1 1 1 1
symmnumber: 1
zpe: 860911.7 jmol-1
zpe.correction: 0.327904 hartree
zpe.thermalcorrener: 0.343194 hartree
zpe.thermalcorrenthalpy: 0.344138 hartree
zpe.thermalcorrgfe: 0.285082 hartree
zpe.sumelectzpe: -449.012883 hartree
zpe.sumelectthermal: -448.997594 hartree
zpe.sumelectthermalent: -448.996649 hartree
zpe.sumelectthermalfe: -449.055705 hartree
dipole: -12.7213 0.0159 0.0047
dipole: 12.7213
quadrupole: -13.4986 -65.0498 -63.9162
quadrupole: -0.4508 -0.0304 0.0020
quadrupole: 33.9896 -17.5616 -16.4280 -0.4508 -0.0304 0.0020
hfenergy: -449.3407871 hartree
pointgroup: C01 [X(C10H24N1)]
dipole: 5.0044941 -0.0666577 0.0043487 debye
polarizability: 144.747059|-0.6288033|100.3025105|0.0795693|0.0443553|97.7274435 unknown
InChI: InChI=1S/C10H24N/c1-5-6-7-8-9-10-11(2,3)4/h5-10H2,1-4H3
charge 1 multiplicity 1
35 atoms
N  3.185353 -0.053736 0.006856
C  1.778053 0.616934 0.031286
C  0.572451 -0.333236 0.002281
C  -0.743541 0.492321 0.019755
C  3.37382 -0.86362 -1.273418
C  4.237676 1.054794 0.051815
C  3.370512 -0.96241 1.219356
C  -2.000864 -0.407425 -0.001795
C  -3.316094 0.404391 0.007712
C  -4.576703 -0.490704 -0.011465
C  -5.886824 0.325188 -0.00419
H  1.761175 1.234646 0.947539
H  1.758262 1.293695 -0.84213
H  0.577262 -0.961429 -0.908377
H  0.57261 -1.008013 0.878906
H  -0.767826 1.173664 -0.855028
H  -0.769913 1.133494 0.924333
H  -1.978143 -1.054763 -0.90275
H  -1.985045 -1.086983 0.875179
H  2.660679 -1.69919 -1.288757
H  3.200271 -0.208911 -2.141128
H  4.402682 -1.254476 -1.299826
H  5.241613 0.603403 0.034341
H  4.10827 1.710137 -0.822827
H  4.10704 1.637529 0.976228
H  3.193724 -0.378899 2.135827
H  2.657622 -1.796461 1.164855
H  4.399534 -1.353716 1.21767
H  -3.338616 1.083748 -0.869539
H  -3.344368 1.053931 0.907101
H  -4.54996 -1.141019 -0.90934
H  -4.557334 -1.168727 0.865799
H  -6.771166 -0.336263 -0.019775
H  -5.947941 0.989146 -0.886605
H  -5.956971 0.959059 0.899412
