program: Orca
programVersion: 4.2.1
elementType: Cl Cl O O O N N N C C C C C C C C C C C C C C C C C C C H H H H H H H H H H H H H H H H H
charge: 0
multiplicity: 1
keywords: wb97x-d3
keywords: def2-TZVPP
keywords: def2/J RIJCOSX GRIDX6 NOFINALGRIDX
keywords: grid4 nofinalgrid
keywords: scfconv7
keywords: smallprint printgap noloewdin
keywords: NOSOSCF
formula: C19H17Cl2N3O3
InChI: InChI=1S/C19H17Cl2N3O3/c1-13-9-25-19(27-13,10-24-12-22-11-23-24)17-7-6-16(8-18(17)21)26-15-4-2-14(20)3-5-15/h2-8,11-13H,9-10H2,1H3
44 atoms
Cl 0.900944 1.385162 -1.340322
Cl -6.73223 -0.714275 -2.039619
O  3.893987 -1.285697 0.725561
O  3.438914 0.050021 -0.993735
O  -2.280545 -1.015095 1.758246
N  3.18819 2.298025 0.840722
N  2.111739 2.769195 1.476047
N  2.727954 4.1653 -0.170165
C  3.175371 -0.135485 0.360721
C  4.050417 -2.111131 -0.435781
C  3.776192 1.02452 1.159392
C  3.454395 -1.249898 -1.553117
C  1.686613 -0.331975 0.654974
C  3.376763 -3.453354 -0.275742
C  0.642314 0.288055 -0.026512
C  1.33089 -1.162806 1.71744
C  -0.687129 0.072147 0.310694
C  0.017199 -1.397491 2.074506
C  -0.996555 -0.779963 1.357985
C  3.532902 3.133063 -0.140256
C  1.875194 3.881382 0.831874
C  -3.296912 -0.937596 0.835876
C  -3.251673 -1.665706 -0.345573
C  -4.394933 -0.151015 1.141802
C  -4.311606 -1.594374 -1.233941
C  -5.462916 -0.088505 0.258736
C  -5.409135 -0.804383 -0.925734
H  5.123079 -2.253804 -0.590654
H  4.844858 1.079122 0.950747
H  3.651134 0.844816 2.225685
H  4.062521 -1.237838 -2.45587
H  2.442803 -1.579799 -1.819958
H  3.799164 -4.014508 0.557641
H  3.527459 -4.045506 -1.179681
H  2.302588 -3.350845 -0.116523
H  2.106944 -1.659819 2.2821
H  -1.464508 0.579744 -0.244331
H  -0.217187 -2.057584 2.898824
H  4.378698 2.961389 -0.786522
H  1.055849 4.526524 1.107671
H  -2.399922 -2.290171 -0.582524
H  -4.423931 0.410624 2.066045
H  -4.277324 -2.158254 -2.15575
H  -6.321164 0.52451 0.496312
elementType: Cl O N C H
totalener: -2044.68637544 hartree
nucrepener: 2793.76683508 hartree
electener: -4838.45321052 hartree
oneelecener: -8358.97628386 hartree
twoeener: 3520.52307334 hartree
cpcmener: -0.03518227 hartree
kineticenergy: 2038.71232436 hartree
xcener: -149.991904031670 hartree
chargesum: -0.0000000
charge: -0.078172 -0.099767 -0.410378 -0.372416 -0.332918 0.095393 -0.345673 -0.405477 0.624486 0.162726 -0.068614 -0.025020 -0.075608 -0.293966 -0.059600 -0.210993 -0.108362 -0.233085 0.241897 0.064336 0.054460 0.258486 -0.183408 -0.235052 -0.129588 -0.114840 0.071906 0.088462 0.126698 0.129788 0.118969 0.088766 0.096734 0.105538 0.082430 0.146789 0.128316 0.151606 0.171359 0.160173 0.162021 0.153931 0.149158 0.148508
qa: -0.0782 -0.0998 -0.4104 -0.3724 -0.3329 0.0954 -0.3457 -0.4055 0.6245 0.1627 -0.0686 -0.0250 -0.0756 -0.2940 -0.0596 -0.2110 -0.1084 -0.2331 0.2419 0.0643 0.0545 0.2585 -0.1834 -0.2351 -0.1296 -0.1148 0.0719 0.0885 0.1267 0.1298 0.1190 0.0888 0.0967 0.1055 0.0824 0.1468 0.1283 0.1516 0.1714 0.1602 0.1620 0.1539 0.1492 0.1485
va: 1.2425 1.2034 1.9638 1.9959 2.0722 3.3719 2.8716 3.0202 3.7516 3.8878 3.8463 3.9427 3.4885 3.9680 3.9871 3.9830 3.9057 4.0338 3.8092 4.0734 4.0597 3.7053 3.9617 4.0407 3.9605 3.9471 3.8336 1.0034 1.0176 1.0116 0.9983 1.0031 1.0048 1.0063 1.0001 1.0228 1.0260 1.0054 1.0002 0.9973 0.9933 1.0034 1.0023 1.0012
dispcorr: -0.025917979 hartree
energy: -2044.712293417439
dipole: 25.20376 -23.87544 1.32832 -14.20232 11.67683 -2.52549 6.86203 -6.83100 0.03104
magnitude: 2.85368 au
magnitude: 7.25349 debye
