program: Orca
programVersion: 4.2.1
elementType: Cl Cl O O O N N N C C C C C C C C C C C C C C C C C C C H H H H H H H H H H H H H H H H H
charge: 0
multiplicity: 1
keywords: wb97x-d3
keywords: def2-TZVPP
keywords: def2/J RIJCOSX GRIDX6 NOFINALGRIDX
keywords: grid4 nofinalgrid
keywords: scfconv7
keywords: smallprint printgap noloewdin
keywords: NOSOSCF
formula: C19H17Cl2N3O3
InChI: InChI=1S/C19H17Cl2N3O3/c1-13-9-25-19(27-13,10-24-12-22-11-23-24)17-7-6-16(8-18(17)21)26-15-4-2-14(20)3-5-15/h2-8,11-13H,9-10H2,1H3
44 atoms
Cl 1.14781 -0.531116 1.902569
Cl -6.7959 0.696359 0.726048
O  3.783464 -0.383596 0.738194
O  4.154185 -0.276681 -1.451017
O  -2.017316 -1.447906 -1.905016
N  2.408429 2.231214 0.544666
N  1.133891 2.516203 0.258529
N  1.572724 2.949261 2.417382
C  3.25958 0.123505 -0.449467
C  4.516832 -1.575311 0.443314
C  3.301068 1.655384 -0.42602
C  4.575333 -1.58104 -1.089846
C  1.849637 -0.385376 -0.752315
C  3.870681 -2.811613 1.026128
C  0.867623 -0.653948 0.199075
C  1.473674 -0.498239 -2.089611
C  -0.419917 -1.019265 -0.162217
C  0.191132 -0.840927 -2.477587
C  -0.758474 -1.092625 -1.502641
C  2.646851 2.479944 1.83344
C  0.678369 2.931607 1.410633
C  -3.101613 -0.916393 -1.253437
C  -4.206885 -1.737156 -1.086275
C  -3.130381 0.403521 -0.81975
C  -5.351186 -1.23862 -0.483364
C  -4.269889 0.898295 -0.206267
C  -5.372688 0.074617 -0.041403
H  5.515805 -1.450518 0.868864
H  3.034337 2.045281 -1.407166
H  4.316615 1.981205 -0.199224
H  5.57919 -1.744591 -1.478838
H  3.910381 -2.341497 -1.515577
H  4.480705 -3.684154 0.787344
H  2.872656 -2.980527 0.618958
H  3.796371 -2.749012 2.11126
H  2.201045 -0.292433 -2.862527
H  -1.151923 -1.231593 0.605359
H  -0.067133 -0.90298 -3.525927
H  3.611509 2.329944 2.29184
H  -0.343411 3.258624 1.524662
H  -4.179739 -2.763472 -1.428529
H  -2.277535 1.056791 -0.953152
H  -6.212189 -1.880033 -0.354462
H  -4.290365 1.92467 0.133555
elementType: Cl O N C H
totalener: -2044.68478163 hartree
nucrepener: 2824.17133952 hartree
electener: -4868.85612115 hartree
oneelecener: -8419.83135577 hartree
twoeener: 3550.97523462 hartree
cpcmener: -0.03306372 hartree
kineticenergy: 2038.70120435 hartree
xcener: -149.990083129323 hartree
chargesum: -0.0000000
charge: -0.079494 -0.101889 -0.381585 -0.395441 -0.335250 0.100149 -0.341571 -0.404795 0.626892 0.165247 -0.064773 -0.021982 -0.109060 -0.297038 -0.042707 -0.167241 -0.117322 -0.245812 0.232884 0.057190 0.060380 0.277963 -0.253692 -0.178457 -0.108698 -0.136258 0.066882 0.088420 0.129670 0.127128 0.116491 0.091239 0.109590 0.079858 0.092411 0.146938 0.131978 0.151738 0.170962 0.157488 0.152735 0.153255 0.147565 0.148010
qa: -0.0795 -0.1019 -0.3816 -0.3954 -0.3352 0.1001 -0.3416 -0.4048 0.6269 0.1652 -0.0648 -0.0220 -0.1091 -0.2970 -0.0427 -0.1672 -0.1173 -0.2458 0.2329 0.0572 0.0604 0.2780 -0.2537 -0.1785 -0.1087 -0.1363 0.0669 0.0884 0.1297 0.1271 0.1165 0.0912 0.1096 0.0799 0.0924 0.1469 0.1320 0.1517 0.1710 0.1575 0.1527 0.1533 0.1476 0.1480
va: 1.2342 1.2018 1.9954 1.9756 2.0696 3.3539 2.8475 3.0234 3.7713 3.8831 3.8391 3.9479 3.5562 3.9603 3.9298 3.9641 3.9585 4.0533 3.8165 4.0791 4.0425 3.6978 4.0384 3.9296 3.9509 3.9754 3.8328 1.0008 1.0114 1.0185 0.9972 0.9995 1.0083 1.0001 1.0077 1.0225 1.0219 1.0050 1.0005 0.9976 1.0047 1.0025 1.0010 1.0033
dispcorr: -0.026746755 hartree
energy: -2044.711528388532
dipole: 27.38665 -25.24322 2.14342 -9.08405 7.53617 -1.54788 -7.91821 6.47277 -1.44545
magnitude: 3.01322 au
magnitude: 7.65900 debye
