program: Gaussian 09
title: 000030193
version: EM64L-G09RevD.01
frameworkgroup: C1[X(C12H22O5)]
method: RPBEPBE
basis: SDD
operation: Freq
keyword: #pfreq=noraman
keyword: PBEPBE/SDD
title: #p freq=noraman PBEPBE/SDD
converged: YES YES NO NO
title: Mulliken charges:
elementType: O O O O O C C C C C C C C C C C C H H H H H H H H H H H H H H H H H H H H H H
charge: -0.271982 -0.274602 -0.274005 -0.228894 -0.220648 0.092021 -0.411499 -0.376333 0.193265 0.185976 -0.318460 -0.719531 -0.221890 -0.223108 -0.499163 -0.674430 -0.673078 0.224390 0.243371 0.210962 0.228123 0.218056 0.210833 0.209975 0.236444 0.234978 0.226414 0.234866 0.226156 0.233186 0.230519 0.201682 0.199805 0.213486 0.229438 0.230430 0.212476 0.229544 0.231224
chargesum: 0.00000
title: Mulliken charges with hydrogens summed into heavy atoms:
elementType: O O O O O C C C C C C C C C C C C
charge: -0.271982 -0.274602 -0.274005 -0.228894 -0.220648 0.092021 0.056262 0.062752 0.193265 0.185976 0.110430 -0.038134 0.239391 0.236234 0.132843 -0.001075 0.000166
polarizability: 1.73866768e+02 2.87276287e+00 1.42888002e+02 -1.59171993e+00 -1.33156978e+00 1.25446966e+02
1716.lowfreq: -14.5089 -7.8402 -4.2988 0.0005 0.0005 0.0007 2.0695 21.9444 38.4617
frequency: -8.8050 21.9157 38.4106 50.2166 51.6650 60.2770 84.4042 91.7444 105.9582 114.5693 122.0780 134.0525 150.5823 188.9212 195.4087 205.8318 228.2425 237.5453 247.7211 256.9013 273.7089 295.0922 303.1595 306.3931 340.0065 380.8898 386.9414 445.2984 509.9789 569.8106 638.8609 704.7131 730.7230 785.8093 790.9599 797.4103 797.9133 798.9492 814.8873 844.6534 889.2423 926.9254 947.0486 1008.1793 1022.8303 1023.0239 1055.5642 1063.8192 1071.0707 1085.9965 1101.2162 1111.1280 1112.6501 1116.0924 1123.5444 1135.5211 1135.8940 1154.1752 1167.1417 1175.1147 1232.0596 1247.9590 1248.6159 1275.7116 1294.3329 1324.1787 1334.0444 1355.5622 1356.4866 1390.1770 1398.6587 1399.8370 1400.6467 1439.8432 1451.8921 1458.1828 1462.4689 1463.4140 1465.8238 1470.7111 1473.4734 1474.1937 1476.2889 1485.9708 1486.5580 1487.4516 1488.1799 1611.7224 1643.1440 2922.3068 2945.0772 2990.6230 2993.9387 2995.2791 2995.5955 2995.8540 2998.8948 3010.4358 3011.3490 3011.7267 3057.2455 3068.7626 3070.0476 3081.5906 3082.8520 3091.9525 3092.2246 3098.4759 3099.5084 3106.8389 3107.3494
redmass: 3.5588 3.1732 3.4749 2.0939 2.7461 2.9933 2.7754 2.6172 3.2201 3.9053 2.3715 2.3167 2.8610 3.1664 1.5276 2.7687 1.1648 2.4983 1.4713 1.8162 2.1886 2.9428 5.0516 3.9824 4.0084 3.6411 3.8090 3.3726 4.4961 5.1972 2.9633 4.8765 5.3105 1.4790 3.8481 1.1311 1.1156 3.0054 1.5926 4.1545 4.8701 2.3775 2.8903 2.5177 2.3367 2.3194 2.2722 3.9417 2.4668 3.7812 2.9168 2.2554 2.2262 1.2992 3.1068 1.4734 1.4886 3.2099 1.8717 1.5175 1.6205 1.1339 1.1345 1.1477 1.3462 1.3964 1.3518 1.4140 1.3945 1.3191 1.2315 1.2456 1.2643 1.1598 1.0809 1.0512 1.0405 1.0406 1.0810 1.0628 1.0601 1.0573 1.0444 1.0594 1.0664 1.0638 1.0760 11.5058 11.4235 1.0347 1.0549 1.0383 1.1016 1.0373 1.0532 1.0412 1.1025 1.0583 1.0585 1.0632 1.1001 1.1064 1.1063 1.0989 1.1019 1.0985 1.0985 1.1006 1.0972 1.1028 1.1025
irintensity: 0.8825 0.6828 0.2738 6.0860 2.0055 1.2295 1.1208 0.5520 2.3897 2.1568 2.6504 1.3695 3.1577 4.3690 0.5173 1.2674 3.2078 1.4479 0.5735 1.4063 0.5923 8.0010 0.3398 2.2362 17.4164 2.3373 2.2541 2.7738 7.4775 12.1844 0.9604 2.2557 4.8443 5.9309 5.0255 3.0698 2.2366 9.1732 5.4350 0.5070 13.7620 57.5599 4.8817 18.3032 69.5630 41.2978 298.0418 99.6170 426.4601 20.5164 3.6652 3.6184 4.1043 8.5848 5.0523 4.0157 6.9463 0.1607 8.7039 27.4820 91.3725 0.1276 0.0649 5.3305 3.4009 50.0131 3.7169 0.2610 0.0760 4.5383 18.1385 26.3851 24.8812 0.3524 1.2346 11.6928 11.2246 11.9840 20.7077 11.4088 6.8077 1.2875 9.8310 3.1125 5.8495 17.0248 10.8902 105.7309 203.1116 83.4555 43.1884 32.7626 104.0659 19.3713 9.6553 28.2570 8.7862 24.1151 16.2014 23.8294 4.3474 6.7427 5.3531 28.8047 22.4370 32.6119 29.2683 39.1655 35.2664 40.4812 43.1604
temp: 298.150 k
press: 1.00000 atm
elementType: 8 8 8 8 8 6 6 6 6 6 6 6 6 6 6 6 6 1 1 1 1 1 1 1 1 1 1 1 1 1 1 1 1 1 1 1 1 1 1
symmnumber: 1
zpe: 858047.3 jmol-1
zpe.correction: 0.326813 hartree
zpe.thermalcorrener: 0.347609 hartree
zpe.thermalcorrenthalpy: 0.348553 hartree
zpe.thermalcorrgfe: 0.275725 hartree
zpe.sumelectzpe: -845.196786 hartree
zpe.sumelectthermal: -845.175991 hartree
zpe.sumelectthermalent: -845.175046 hartree
zpe.sumelectthermalfe: -845.247875 hartree
dipole: 0.0738 0.3361 1.2429
dipole: 1.2897
quadrupole: -79.9376 -100.0651 -111.7115
quadrupole: -4.3067 -3.4356 -8.1717
quadrupole: 17.3005 -2.8270 -14.4735 -4.3067 -3.4356 -8.1717
hfenergy: -845.5235992 hartree
pointgroup: C01 [X(C12H22O5)]
dipole: 0.005517 0.1370383 0.4885083 debye
polarizability: 172.0413839|7.8459627|144.7059283|-1.2941269|-1.6386812|125.4544237 unknown
InChI: InChI=1S/C12H22O5/c1-5-12(8-9-15-4,10(13)16-6-2)11(14)17-7-3/h5-9H2,1-4H3
charge 0 multiplicity 1
39 atoms
O  -2.542326 -0.488524 0.128595
O  2.272983 -0.549752 0.097039
O  0.801505 3.327597 0.813028
O  -1.29938 0.205213 -1.705995
O  0.944377 -1.778124 -1.361078
C  -0.126826 -0.386289 0.403179
C  0.186423 1.023056 1.01288
C  -0.383965 -1.38068 1.59302
C  -1.343119 -0.219638 -0.53031
C  1.042305 -0.962413 -0.419399
C  0.511189 2.133494 0.006061
C  -0.706843 -2.836767 1.202385
C  -3.789661 -0.24225 -0.662518
C  3.484353 -1.146161 -0.549383
C  1.109258 4.48619 -0.020347
C  -4.96322 -0.604864 0.240965
C  4.698186 -0.534102 0.141465
H  -0.68241 1.337215 1.621542
H  1.049916 0.917384 1.691905
H  0.519707 -1.353232 2.232701
H  -1.218701 -0.966121 2.186098
H  -0.33816 2.336292 -0.679156
H  1.397507 1.864148 -0.607554
H  -0.854112 -3.443235 2.114748
H  -1.634262 -2.891089 0.607069
H  0.1025 -3.301278 0.612644
H  -3.799812 0.819476 -0.969135
H  -3.745183 -0.862683 -1.57549
H  3.43438 -2.243786 -0.430006
H  3.446808 -0.917552 -1.629669
H  1.303988 5.323243 0.668859
H  0.25873 4.747205 -0.686594
H  2.008532 4.310058 -0.64942
H  -5.91365 -0.441753 -0.299245
H  -4.970455 0.019221 1.150972
H  -4.915191 -1.664421 0.545306
H  5.624866 -0.944681 -0.299558
H  4.69666 -0.762797 1.220894
H  4.7113 0.562399 0.019003
