program: Orca
programVersion: 4.2.1
elementType: Cl Cl O O O N N N C C C C C C C C C C C C C C C C C C C H H H H H H H H H H H H H H H H H
charge: 0
multiplicity: 1
keywords: wb97x-d3
keywords: def2-TZVPP
keywords: def2/J RIJCOSX GRIDX6 NOFINALGRIDX
keywords: grid4 nofinalgrid
keywords: scfconv7
keywords: smallprint printgap noloewdin
keywords: NOSOSCF
formula: C19H17Cl2N3O3
InChI: InChI=1S/C19H17Cl2N3O3/c1-13-9-25-19(27-13,10-24-12-22-11-23-24)17-7-6-16(8-18(17)21)26-15-4-2-14(20)3-5-15/h2-8,11-13H,9-10H2,1H3
44 atoms
Cl 0.436521 -0.19597 2.023777
Cl -7.555472 -0.768108 0.854495
O  3.123741 -0.218238 0.834713
O  3.456442 0.525376 -1.256291
O  -2.45215 -1.510075 -1.920218
N  3.673455 2.585001 0.62551
N  4.12981 2.507902 1.877443
N  5.661225 3.449765 0.542193
C  2.559095 0.552063 -0.1851
C  4.337161 -0.812294 0.383135
C  2.408594 2.017887 0.243434
C  4.240521 -0.645368 -1.123158
C  1.200756 -0.009994 -0.595467
C  4.433969 -2.243733 0.849812
C  0.207384 -0.365915 0.31452
C  0.896148 -0.154432 -1.946543
C  -1.021617 -0.862635 -0.092251
C  -0.324824 -0.636586 -2.381626
C  -1.284684 -0.994159 -1.448135
C  4.599802 3.140083 -0.160971
C  5.320888 3.039214 1.780904
C  -3.61993 -1.30764 -1.235417
C  -3.995736 -0.04642 -0.790983
C  -4.453978 -2.398869 -1.049837
C  -5.209012 0.117906 -0.143504
C  -5.674522 -2.232756 -0.413456
C  -6.039897 -0.976618 0.042756
H  5.185757 -0.238471 0.775219
H  1.72422 2.110195 1.083861
H  1.997994 2.597211 -0.583598
H  5.203918 -0.480627 -1.603915
H  3.754601 -1.507348 -1.597579
H  4.45532 -2.305801 1.937999
H  5.356286 -2.6928 0.478367
H  3.594686 -2.838886 0.486709
H  1.631319 0.124908 -2.688279
H  -1.75619 -1.146297 0.649956
H  -0.529617 -0.735179 -3.439584
H  4.45278 3.307691 -1.216129
H  5.968539 3.143444 2.637787
H  -3.356606 0.813534 -0.946723
H  -4.156643 -3.37752 -1.403953
H  -5.501592 1.099396 0.203946
H  -6.325972 -3.084073 -0.270164
elementType: Cl O N C H
totalener: -2044.69916366 hartree
nucrepener: 2708.38476797 hartree
electener: -4753.08393163 hartree
oneelecener: -8187.40449174 hartree
twoeener: 3434.32056011 hartree
cpcmener: -0.02984453 hartree
kineticenergy: 2038.70067365 hartree
xcener: -149.987225865395 hartree
chargesum: -0.0000000
charge: -0.076406 -0.098317 -0.359030 -0.393032 -0.322223 0.120582 -0.349596 -0.409359 0.575384 0.142983 -0.116562 -0.002673 -0.113533 -0.274510 -0.031745 -0.100186 -0.150748 -0.261407 0.255973 0.058973 0.054931 0.267445 -0.187750 -0.245187 -0.126426 -0.106105 0.067063 0.071424 0.136213 0.136844 0.115367 0.088959 0.096570 0.095703 0.078085 0.150949 0.131972 0.148370 0.169451 0.159661 0.159114 0.150694 0.146380 0.145707
qa: -0.0764 -0.0983 -0.3590 -0.3930 -0.3222 0.1206 -0.3496 -0.4094 0.5754 0.1430 -0.1166 -0.0027 -0.1135 -0.2745 -0.0317 -0.1002 -0.1507 -0.2614 0.2560 0.0590 0.0549 0.2674 -0.1877 -0.2452 -0.1264 -0.1061 0.0671 0.0714 0.1362 0.1368 0.1154 0.0890 0.0966 0.0957 0.0781 0.1509 0.1320 0.1484 0.1695 0.1597 0.1591 0.1507 0.1464 0.1457
va: 1.2452 1.2051 2.0182 1.9786 2.0854 3.3833 2.8835 3.0308 3.8568 3.9106 3.8023 3.9173 3.6323 3.9746 4.0488 3.8793 3.9688 4.0677 3.8003 4.0693 4.0467 3.7131 3.9572 4.0437 3.9617 3.9478 3.8456 0.9988 1.0281 1.0078 1.0016 1.0015 1.0033 1.0053 1.0091 1.0214 1.0228 1.0083 1.0011 0.9964 0.9934 1.0050 1.0032 1.0020
dispcorr: -0.024203981 hartree
energy: -2044.723367639482
dipole: 29.81566 -30.08207 -0.26641 -3.66637 2.62385 -1.04253 -9.24011 7.40916 -1.83094
magnitude: 2.12372 au
magnitude: 5.39807 debye
