program: Gaussian 09
title: 000030149
version: EM64L-G09RevD.01
frameworkgroup: C1[X(C12H12O2)]
method: RPBEPBE
basis: SDD
operation: Freq
keyword: #pfreq=noraman
keyword: PBEPBE/SDD
title: #p freq=noraman PBEPBE/SDD
converged: YES YES NO NO
title: Mulliken charges:
elementType: O O C C C C C C C C C C C C H H H H H H H H H H H H
charge: -0.270553 -0.433621 -0.688044 0.392343 0.503295 -0.413446 0.317570 -0.370747 -0.442070 -0.374922 -0.455861 -0.219315 -0.223298 -0.247805 0.243326 0.227511 0.258900 0.258902 0.228823 0.237863 0.228713 0.212329 0.226083 0.226312 0.228989 0.348724
chargesum: 0.00000
title: Mulliken charges with hydrogens summed into heavy atoms:
elementType: O O C C C C C C C C C C C C
charge: -0.270553 -0.084897 -0.217207 0.392343 0.503295 -0.154547 0.317570 -0.111845 -0.213247 -0.137059 -0.014820 0.006767 0.003014 -0.018816
polarizability: 1.57537817e+02 -1.39587341e+01 1.16884771e+02 1.44057289e+01 1.51810227e+00 1.11462441e+02
1716.lowfreq: -8.4132 -5.1826 -0.0003 0.0003 0.0008 6.3919 27.0301 30.2158 44.7092
frequency: 26.7438 30.1434 44.6710 73.3088 124.9875 185.5846 220.3171 272.0605 306.2402 329.0285 379.2314 405.2058 410.2817 462.1153 560.1885 600.5933 616.8400 635.7293 696.9785 707.6255 731.4818 766.5465 796.0930 812.4331 854.6581 863.0715 871.6291 905.7677 920.9629 933.4032 955.9244 967.2986 978.0149 990.5515 996.2476 1024.1514 1026.5289 1081.6533 1136.4161 1152.5009 1171.8725 1187.7358 1188.9126 1206.5604 1227.9309 1243.9966 1289.3548 1307.1128 1337.9554 1349.3960 1372.4324 1383.5854 1440.5227 1450.6171 1452.7283 1483.6000 1560.0743 1595.1486 1603.8208 1614.1206 2977.2929 2982.6654 3033.3234 3101.5324 3115.4442 3119.3489 3132.8010 3144.2012 3162.2650 3215.9152 3234.5767 3557.1111
redmass: 3.9895 4.6914 3.9149 4.2137 6.1421 3.7787 3.3076 2.8354 4.2945 1.3734 1.7586 2.8121 5.3821 3.1133 4.9354 5.1652 5.5270 4.0894 3.8445 1.9589 2.3877 2.7009 2.0147 1.7727 1.2526 1.5418 2.4764 1.8259 3.7395 3.5449 2.4217 2.4444 1.3903 5.8864 1.3363 1.2636 2.2282 1.5821 1.4308 1.4949 1.0598 1.1428 2.5458 2.4538 1.4850 2.4527 1.5717 1.2481 1.3432 2.3849 1.2226 7.2658 1.9395 1.1745 1.0975 2.2354 8.8593 6.1902 6.6593 6.0961 1.0687 1.0600 1.1000 1.0947 1.0868 1.0868 1.0911 1.0959 1.1015 1.0941 1.1040 1.0664
irintensity: 0.1167 0.1398 1.3537 2.8964 0.8111 3.0535 1.8453 8.4852 4.5659 123.9988 46.9638 0.3221 8.7767 11.6944 3.8638 1.1036 0.6866 1.1410 9.7509 35.3469 82.6577 7.7806 35.9893 32.7650 0.4572 3.1858 19.0236 33.4882 40.8384 23.2401 8.9393 1.4511 0.1346 0.4619 0.1890 28.4491 7.9462 11.5068 39.8917 5.3832 0.1760 1.6914 2.3110 5.7855 9.6876 6.5038 5.4262 5.9187 1.2802 3.0081 22.1290 0.5374 6.7923 19.9994 8.4969 16.9097 27.5063 0.8346 3.4887 7.8403 55.2274 24.5935 9.3691 14.0203 8.2034 2.3183 9.9980 42.0846 24.4060 5.8105 0.3901 8.9045
temp: 298.150 k
press: 1.00000 atm
elementType: 8 8 6 6 6 6 6 6 6 6 6 6 6 6 1 1 1 1 1 1 1 1 1 1 1 1
symmnumber: 1
zpe: 544882.0 jmol-1
zpe.correction: 0.207535 hartree
zpe.thermalcorrener: 0.220074 hartree
zpe.thermalcorrenthalpy: 0.221018 hartree
zpe.thermalcorrgfe: 0.166246 hartree
zpe.sumelectzpe: -613.884601 hartree
zpe.sumelectthermal: -613.872062 hartree
zpe.sumelectthermalent: -613.871118 hartree
zpe.sumelectthermalfe: -613.925890 hartree
dipole: -1.0665 -2.1047 -0.3884
dipole: 2.3913
quadrupole: -79.0863 -83.7785 -77.7651
quadrupole: -9.5289 1.0329 -1.5358
quadrupole: 1.1236 -3.5685 2.4449 -9.5289 1.0329 -1.5358
hfenergy: -614.092136 hartree
pointgroup: C01[X(C12H12O2)]
dipole: -0.4182116 0.6004521 0.5913074 debye
dipolederiv: -0.4884545 -0.0320705 0.149721 -0.02351 -0.5888563 0.0938851 0.1789819 0.1190801 -0.1995356 -0.3244502 0.0156693 -0.2372836 0.2521953 -0.8267074 -0.1690455 -0.0853487 -0.2207437 -0.5287076 0.1128124 0.0116182 0.0207929 -0.1602843 0.0610278 -0.0162905 0.0418954 -0.0212424 0.1475348 0.3272558 0.0307249 -0.13153 0.0274597 0.292389 -0.1031336 -0.2507374 -0.1350567 0.0163778 0.151511 0.1303004 0.1050227 0.2543421 0.1023613 0.0570397 0.197706 0.0733065 -0.0276485 -0.2143804 -0.037088 -0.0141612 -0.087163 -0.0423374 0.0184588 -0.0106066 -0.0142114 -0.2030408 0.0694651 0.1157818 -0.1367191 0.1600881 0.1066478 -0.1584067 -0.2357148 -0.0317427 0.0086199 -0.0340961 -0.034248 -0.1128602 -0.0260999 -0.0944062 -0.002459 -0.0634059 -0.0292698 -0.1269763 -0.2024857 0.0052623 0.009552 -0.012489 -0.1504481 -0.0449689 -0.0349886 -0.031955 0.0991138 -0.1351808 0.045775 -0.0644036 0.0165408 -0.1103926 -0.055038 -0.1232879 -0.0859288 -0.0586834 0.4085639 -0.0504225 0.1482182 -0.1659428 0.6360515 0.1778286 0.0794498 0.1848171 0.4926157 -0.0255859 0.1125109 -0.0338321 0.0925007 -0.0419066 -0.0581261 -0.0516304 -0.073118 0.014399 -0.0642533 0.060254 0.0200149 0.0632115 -0.0927475 -0.0294669 0.0459979 -0.0207449 0.127819 -0.0461157 0.1065481 0.0684412 0.0908419 -0.0927418 0.0363731 0.0666194 0.0334833 -0.0566013 -0.0004939 -0.0174491 -0.0106943 -0.0017112 -0.1154032 -0.0666955 -0.0171635 -0.00155 0.0890538 -0.025517 -0.017013 0.0286341 -0.0053518 0.0749333 0.1072158 0.0210247 0.0322559 -0.1044674 0.1188796 0.0834671 0.0339712 0.0732951 -0.0186266 0.0017895 0.0284347 0.0025204 0.1692074 0.0212419 -0.0410535 0.0886952 -0.0346572 0.1118173 0.0361804 0.1060029 0.042123 0.131762 0.1118116 -0.0255117 -0.0662159 -0.0201295 0.1227721 0.0030634 -0.0354521 0.0177003 -0.1159198 0.0720028 -0.0931979 0.0675276 -0.0955491 0.0508392 0.0610998 0.0942214 0.053778 0.0379686 -0.0727259 -0.0419673 0.0210209 -0.0792848 0.0387427 -0.0117538 0.0820979 -0.009324 0.0660965 0.0721584 -0.008837 -0.0161036 0.0899153 -0.0716497 0.0550755 -0.0743422 0.048604 -0.1480352 0.0161438 -0.1116143 0.0631342 -0.1274611 0.0512157 0.0771181 0.067302 0.0782277 0.0226478 0.0932743 -0.0346269 -0.0287304 -0.0334266 0.1232068 0.0224632 -0.0550984 0.0166003 -0.1203904 -0.0131341 -0.1184073 -0.0754461 -0.127962 0.0739853 -0.0409957 -0.0831702 -0.0428699 0.0467638 0.0717529 -0.0544053 0.1032339 -0.119368 0.4002334 0.0087891 0.1112128 0.0152606 0.2200264 unknown
polarizability: 152.0190728|23.0722596|118.1358356|-9.7304772|0.2042045|115.7301213 unknown
InChI: InChI=1S/C12H12O2/c13-9-12-7-6-11(14-12)8-10-4-2-1-3-5-10/h1-7,13H,8-9H2
charge 0 multiplicity 1
26 atoms
O  1.523318 -0.132636 0.512261
O  3.046816 -1.908015 -1.586528
C  -0.471213 1.07885 1.359745
C  0.848275 1.100615 0.648439
C  -1.568784 0.26522 0.662917
C  1.611724 2.099604 0.06273
C  2.731453 0.124258 -0.189398
C  2.805675 1.478154 -0.472747
C  -2.432416 -0.561482 1.422565
C  -1.765388 0.352208 -0.738457
C  3.575986 -1.07009 -0.484656
C  -3.476625 -1.282446 0.798942
C  -2.806937 -0.3670 -1.365013
C  -3.668398 -1.186427 -0.598242
H  -0.800294 2.131304 1.461718
H  -0.337539 0.691983 2.388804
H  1.349936 3.155208 0.017759
H  3.616078 1.97152 -1.005975
H  -2.285081 -0.645404 2.50672
H  -1.094541 0.979117 -1.338777
H  4.566598 -0.743513 -0.836678
H  3.703286 -1.686736 0.428938
H  -4.134928 -1.919251 1.400786
H  -2.946016 -0.290402 -2.449479
H  -4.475394 -1.746017 -1.084372
H  2.122608 -2.179523 -1.350501
