program: Orca
programVersion: 4.2.1
elementType: Cl Cl O O O N N N C C C C C C C C C C C C C C C C C C C H H H H H H H H H H H H H H H H H
charge: 0
multiplicity: 1
keywords: wb97x-d3
keywords: def2-TZVPP
keywords: def2/J RIJCOSX GRIDX6 NOFINALGRIDX
keywords: grid4 nofinalgrid
keywords: scfconv7
keywords: smallprint printgap noloewdin
keywords: NOSOSCF
formula: C19H17Cl2N3O3
InChI: InChI=1S/C19H17Cl2N3O3/c1-13-9-25-19(27-13,10-24-12-22-11-23-24)17-7-6-16(8-18(17)21)26-15-4-2-14(20)3-5-15/h2-8,11-13H,9-10H2,1H3
44 atoms
Cl 0.972688 0.205539 -2.396671
Cl -6.878892 -1.565463 -1.853471
O  3.934172 -0.490392 0.943565
O  3.453715 -0.934423 -1.189362
O  -2.304114 -0.020173 1.458614
N  3.071917 2.371413 0.264874
N  3.471948 2.536954 1.526218
N  1.783844 3.929565 1.049351
C  3.160613 -0.062461 -0.141424
C  4.321021 -1.853106 0.74291
C  3.615404 1.339637 -0.575844
C  3.670975 -2.198229 -0.595154
C  1.677936 -0.080649 0.232155
C  3.883528 -2.738347 1.8855
C  0.649684 0.0318 -0.699927
C  1.299946 -0.145314 1.571647
C  -0.68788 0.046077 -0.333543
C  -0.02379 -0.141962 1.96805
C  -1.021864 -0.054678 1.009118
C  2.058811 3.198893 -0.002839
C  2.675279 3.48231 1.955311
C  -3.338929 -0.394543 0.644369
C  -4.42155 0.464217 0.54304
C  -3.343282 -1.619208 -0.010401
C  -5.520615 0.100371 -0.220004
C  -4.43443 -1.977472 -0.784757
C  -5.515265 -1.114484 -0.885492
H  5.411867 -1.878381 0.657086
H  3.285544 1.536105 -1.594063
H  4.704044 1.391741 -0.560765
H  4.315282 -2.787573 -1.246373
H  2.726998 -2.740763 -0.459058
H  4.215295 -3.7621 1.703464
H  2.797982 -2.752093 1.99481
H  4.322604 -2.416057 2.830028
H  2.063462 -0.204924 2.333442
H  -1.44841 0.147554 -1.096032
H  -0.280531 -0.202259 3.017592
H  1.570391 3.237246 -0.964471
H  2.741917 3.869157 2.960456
H  -4.412608 1.414365 1.061234
H  -2.507368 -2.30146 0.07787
H  -6.366445 0.769684 -0.297114
H  -4.438084 -2.929825 -1.297103
elementType: Cl O N C H
totalener: -2044.69714504 hartree
nucrepener: 2777.26915064 hartree
electener: -4821.96629568 hartree
oneelecener: -8325.45865051 hartree
twoeener: 3503.49235483 hartree
cpcmener: -0.03039072 hartree
kineticenergy: 2038.70454745 hartree
xcener: -149.989405822433 hartree
chargesum: -0.0000000
charge: -0.075209 -0.097733 -0.386574 -0.358623 -0.318023 0.126644 -0.348561 -0.401300 0.607156 0.135674 -0.145657 0.007549 -0.124608 -0.288558 -0.046113 -0.162836 -0.137929 -0.256533 0.284217 0.076541 0.059737 0.273470 -0.239758 -0.198845 -0.108844 -0.122051 0.067210 0.079786 0.137276 0.125024 0.114927 0.080903 0.104274 0.081387 0.098365 0.153427 0.128810 0.148298 0.164133 0.160093 0.151164 0.159292 0.145600 0.146798
qa: -0.0752 -0.0977 -0.3866 -0.3586 -0.3180 0.1266 -0.3486 -0.4013 0.6072 0.1357 -0.1457 0.0075 -0.1246 -0.2886 -0.0461 -0.1628 -0.1379 -0.2565 0.2842 0.0765 0.0597 0.2735 -0.2398 -0.1988 -0.1088 -0.1221 0.0672 0.0798 0.1373 0.1250 0.1149 0.0809 0.1043 0.0814 0.0984 0.1534 0.1288 0.1483 0.1641 0.1601 0.1512 0.1593 0.1456 0.1468
va: 1.2482 1.2057 1.9863 2.0176 2.0949 3.3521 2.8847 3.0338 3.7996 3.9312 3.8875 3.9382 3.5173 3.9497 4.0319 3.8630 3.9467 4.0908 3.7962 4.0495 4.0506 3.7038 4.0464 3.9700 3.9472 3.9564 3.8493 1.0016 1.0105 1.0234 0.9951 1.0031 1.0065 1.0025 1.0044 1.0240 1.0254 1.0072 1.0005 0.9960 1.0048 0.9940 1.0020 1.0031
dispcorr: -0.025814170 hartree
energy: -2044.722959213306
dipole: 25.86001 -25.23436 0.62565 -7.10149 5.27946 -1.82203 14.51156 -14.79043 -0.27888
magnitude: 1.94653 au
magnitude: 4.94769 debye
