program: Gaussian 09
title: 000030121
version: EM64L-G09RevD.01
frameworkgroup: C1[X(C7H5ClN2S)]
method: RPBEPBE
basis: SDD
operation: Freq
keyword: #p
keyword: freq=noraman
keyword: PBEPBE/SDD
title: #p freq=noraman PBEPBE/SDD
converged: NO YES NO YES
title: Mulliken charges:
elementType: Cl S N N C C C C C C C H H H H H
charge: -0.051840 0.254174 -0.043497 -0.565340 -0.246745 0.349465 -0.123403 -0.354607 -0.170039 -0.273140 -0.194160 0.257174 0.254632 0.233233 0.333817 0.340277
chargesum: 0.00000
title: Mulliken charges with hydrogens summed into heavy atoms:
elementType: Cl S N N C C C C C C C
charge: -0.051840 0.254174 -0.043497 0.108754 -0.246745 0.349465 -0.123403 -0.097434 -0.170039 -0.018508 0.039073
polarizability: 1.66067369e+02 1.05694074e+01 1.34909429e+02 -8.46206411e-03 1.16925803e-02 4.24974111e+01
1716.lowfreq: -5.3024 -3.9698 -0.0030 -0.0026 -0.0023 4.5438 102.4777 140.3855 152.7501
frequency: 102.4767 140.3844 152.7488 224.9717 293.6705 297.7573 333.1948 363.1788 427.4639 449.6982 472.9758 501.0559 519.7873 558.6320 561.8291 594.4578 640.0422 709.6347 724.1215 778.0240 884.6782 886.3981 964.3402 1021.5445 1048.5570 1081.1744 1144.5851 1194.8260 1252.2144 1298.2682 1353.3961 1425.8815 1439.8069 1552.2077 1578.5131 1604.2029 1645.7213 3148.0759 3172.6290 3182.8808 3554.5872 3705.8333
redmass: 9.8360 5.4765 12.8424 5.2814 4.3396 4.3023 1.2115 11.2900 7.6873 1.2555 7.2111 4.4739 9.6112 3.7905 4.6407 7.3802 8.1390 2.7527 6.8389 1.5984 1.3974 6.5435 1.3231 4.9694 2.4247 2.0127 1.4275 1.5006 2.6644 4.3075 3.1719 6.0773 2.7503 6.5407 2.7364 2.1763 3.6665 1.0873 1.0926 1.0987 1.0453 1.1046
irintensity: 2.2576 8.1222 2.6353 1.6003 3.0359 4.4522 69.1783 3.8349 0.1356 257.1511 4.7839 1.7650 9.0595 5.5117 15.9092 10.2040 1.1740 14.9548 13.6829 71.6972 1.6366 82.9588 1.4803 24.1356 4.0196 9.4850 3.1389 2.0217 104.9401 30.8514 10.3394 31.0742 50.0447 55.3581 130.0053 101.6895 461.9845 8.5939 2.9964 8.3466 151.7203 51.4685
temp: 298.150 k
press: 1.00000 atm
elementType: 17 16 7 7 6 6 6 6 6 6 6 1 1 1 1 1
symmnumber: 1
zpe: 281041.2 jmol-1
zpe.correction: 0.107043 hartree
zpe.thermalcorrener: 0.116542 hartree
zpe.thermalcorrenthalpy: 0.117487 hartree
zpe.thermalcorrgfe: 0.071984 hartree
zpe.sumelectzpe: -1236.609487 hartree
zpe.sumelectthermal: -1236.599988 hartree
zpe.sumelectthermalent: -1236.599044 hartree
zpe.sumelectthermalfe: -1236.644546 hartree
dipole: -2.9437 0.1281 0.0004
dipole: 2.9465
quadrupole: -56.8500 -74.2268 -82.1249
quadrupole: 10.5644 -0.0006 0.0004
quadrupole: 14.2172 -3.1596 -11.0577 10.5644 -0.0006 0.0004
hfenergy: -1236.7165302 hartree
pointgroup: C01 [X(C7H5Cl1N2S1)]
dipole: -1.1360634 -0.2307145 -0.0001433 debye
dipolederiv: -0.2518696 -0.1986286 -0.0000392 -0.3089339 -0.6410319 -0.0001023 -0.0000466 -0.0000672 -0.0579907 -0.39753 -0.0344761 -0.0000403 -0.0987557 -0.3733014 -0.0000534 -0.0000516 -0.0000165 0.0773579 -1.2057138 0.1745669 -0.0000342 0.521623 -0.8676007 -0.0000415 0.0000798 -0.0001269 -0.2390188 -1.8164515 0.1853627 0.0000055 0.0962347 -0.2541463 0.0001175 -0.0000842 0.000126 -0.7030586 0.0536198 -0.2602276 0.0000201 -0.7003838 -0.1870176 -0.0000713 -0.0000869 -0.000044 -0.079164 0.891055 -0.1167801 0.0000206 0.2105856 0.0995275 0.0000208 0.0000086 0.0000307 0.0767175 0.3935191 0.2767684 0.0000452 0.5417797 0.9366909 0.000166 0.0000898 0.0001076 -0.0294791 -0.160584 0.0146806 0.0000009 0.1416446 0.0321147 0.0000441 0.0000344 0.0000226 -0.1733952 2.0272632 -0.0219472 0.0000601 -0.3083753 1.0909647 0.0000733 0.0001162 0.0001027 0.1049906 -0.1942858 -0.0102219 -0.0000051 -0.0559768 -0.2729907 -0.0000212 -0.0000062 -0.0000029 -0.1458885 0.099803 0.0191569 0.0000244 -0.0666788 0.0948739 0.0000461 0.0000057 0.000048 -0.1546358 0.0707997 -0.0606427 -0.000018 -0.0295017 -0.04243 -0.0000368 -0.000004 -0.0000325 0.1745228 -0.0412544 -0.0281926 -0.000017 -0.0335724 0.0883028 -0.000018 -0.0000111 -0.0000172 0.1766326 -0.011264 0.0979506 0.000007 0.0987625 -0.033798 -0.0000262 0.0000006 -0.0000339 0.1626572 0.2840159 -0.0461809 -0.0000209 -0.0990199 0.165466 -0.0000521 -0.0000204 -0.0000504 0.4042353 0.2588772 0.0088115 -0.000009 0.0905682 0.164376 -0.000045 -0.0000239 -0.000046 0.4055167 unknown
polarizability: 168.5687121|-5.2458507|132.4080853|0.0065316|0.012871|42.4974111 unknown
InChI: InChI=1S/C7H5ClN2S/c8-4-2-1-3-5-6(4)11-7(9)10-5/h1-3H,9H2
charge 0 multiplicity 1
16 atoms
Cl 2.121563 2.525408 0.000398
S  -1.210562 1.64662 -0.000013
N  -1.654759 -1.039019 -0.000355
N  -3.653471 0.268289 -0.00025
C  0.19304 0.497943 0.000003
C  -0.258608 -0.866946 -0.000294
C  1.562753 0.788378 0.000163
C  0.692629 -1.913719 -0.000393
C  -2.290493 0.116556 -0.000171
C  2.514868 -0.250041 0.000026
C  2.066633 -1.596013 -0.000241
H  0.344166 -2.949906 -0.000578
H  3.581724 -0.011528 0.000114
H  2.809075 -2.400552 -0.000336
H  -4.093643 1.183275 -0.000097
H  -4.229415 -0.571146 -0.000478
