program: Orca
programVersion: 4.2.1
elementType: Cl Cl O O O N N N C C C C C C C C C C C C C C C C C C C H H H H H H H H H H H H H H H H H
charge: 0
multiplicity: 1
keywords: wb97x-d3
keywords: def2-TZVPP
keywords: def2/J RIJCOSX GRIDX6 NOFINALGRIDX
keywords: grid4 nofinalgrid
keywords: scfconv7
keywords: smallprint printgap noloewdin
keywords: NOSOSCF
formula: C19H17Cl2N3O3
InChI: InChI=1S/C19H17Cl2N3O3/c1-13-9-25-19(27-13,10-24-12-22-11-23-24)17-7-6-16(8-18(17)21)26-15-4-2-14(20)3-5-15/h2-8,11-13H,9-10H2,1H3
44 atoms
Cl 1.783823 -1.084665 2.606995
Cl -7.744528 -0.179829 -1.736209
O  3.512609 -0.267981 0.327991
O  2.650746 1.031839 -1.287542
O  -2.614758 -1.954569 0.458036
N  3.779948 2.466302 0.909249
N  4.008623 3.46381 0.051904
N  5.875537 2.957197 1.179464
C  2.456037 0.592104 0.027204
C  4.115358 -0.703517 -0.885928
C  2.507979 1.799521 0.977333
C  3.853799 0.484184 -1.79998
C  1.098256 -0.094411 0.145552
C  3.528652 -2.008044 -1.387841
C  0.720045 -0.843352 1.259335
C  0.159415 0.02718 -0.875221
C  -0.530638 -1.429722 1.357703
C  -1.090919 -0.564457 -0.813013
C  -1.435319 -1.292436 0.316154
C  4.903427 2.169147 1.568395
C  5.274241 3.728145 0.250868
C  -3.772782 -1.481299 -0.09165
C  -4.644597 -2.423956 -0.617213
C  -4.120036 -0.136799 -0.068005
C  -5.872904 -2.026179 -1.119176
C  -5.343266 0.262888 -0.582968
C  -6.212601 -0.682739 -1.103668
H  5.181162 -0.82874 -0.686879
H  2.333412 1.491472 2.006465
H  1.729061 2.51197 0.710751
H  4.661129 1.221902 -1.760974
H  3.701407 0.198033 -2.841912
H  2.487759 -1.904419 -1.699359
H  3.578653 -2.779646 -0.619038
H  4.099121 -2.360134 -2.248615
H  0.412037 0.592602 -1.760634
H  -0.802862 -2.001945 2.234861
H  -1.772998 -0.457368 -1.646062
H  4.961339 1.392442 2.314507
H  5.783594 4.511809 -0.288473
H  -4.368961 -3.470641 -0.626516
H  -3.456192 0.607148 0.353362
H  -6.552942 -2.76405 -1.522702
H  -5.614259 1.309707 -0.564916
elementType: Cl O N C H
totalener: -2044.69805689 hartree
nucrepener: 2700.60295291 hartree
electener: -4745.30100980 hartree
oneelecener: -8171.55871635 hartree
twoeener: 3426.25770655 hartree
cpcmener: -0.02834346 hartree
kineticenergy: 2038.69379100 hartree
xcener: -149.988660063718 hartree
chargesum: 0.0000000
charge: -0.081222 -0.099497 -0.377289 -0.390758 -0.320824 0.130530 -0.355432 -0.408521 0.566244 0.203864 -0.140109 -0.015032 -0.149772 -0.306660 0.056911 -0.135147 -0.246167 -0.208742 0.284820 0.063690 0.057101 0.311311 -0.263304 -0.216797 -0.099977 -0.120951 0.057695 0.094676 0.147284 0.129456 0.087791 0.098914 0.092685 0.091165 0.102874 0.148773 0.128102 0.157319 0.164604 0.160123 0.149387 0.158878 0.145772 0.146230
qa: -0.0812 -0.0995 -0.3773 -0.3908 -0.3208 0.1305 -0.3554 -0.4085 0.5662 0.2039 -0.1401 -0.0150 -0.1498 -0.3067 0.0569 -0.1351 -0.2462 -0.2087 0.2848 0.0637 0.0571 0.3113 -0.2633 -0.2168 -0.1000 -0.1210 0.0577 0.0947 0.1473 0.1295 0.0878 0.0989 0.0927 0.0912 0.1029 0.1488 0.1281 0.1573 0.1646 0.1601 0.1494 0.1589 0.1458 0.1462
va: 1.2380 1.2042 1.9896 1.9876 2.0906 3.3659 2.8765 3.0307 3.8692 3.8469 3.8070 3.9944 3.5682 3.9694 3.9291 3.9261 4.1466 3.9786 3.7876 4.0687 4.0460 3.6800 4.0478 3.9675 3.9439 3.9590 3.8546 0.9983 1.0162 1.0240 0.9968 0.9977 0.9957 1.0112 1.0071 1.0275 1.0285 0.9969 1.0043 0.9960 1.0064 0.9945 1.0020 1.0031
dispcorr: -0.024776545 hartree
energy: -2044.722833436105
dipole: 23.46361 -24.01039 -0.54678 -0.90854 -0.37370 -1.28223 -9.36697 8.71339 -0.65358
magnitude: 1.53956 au
magnitude: 3.91326 debye
