program: Gaussian 09
title: 000030156
version: EM64L-G09RevD.01
frameworkgroup: C1[X(C12H13ClN2O2)]
method: RPBEPBE
basis: SDD
operation: Freq
keyword: #p
keyword: freq=noraman
keyword: PBEPBE/SDD
title: #p freq=noraman PBEPBE/SDD
converged: YES YES NO NO
title: Mulliken charges:
elementType: Cl O O N N C C C C C C C C C C C C H H H H H H H H H H H H H
charge: -0.048003 -0.284238 -0.243478 -0.214263 -0.054690 0.284072 0.197727 0.104132 0.172066 -0.578321 -0.312615 -0.311747 -0.643979 -0.229387 -0.125827 -0.214603 -0.679033 0.233074 0.269269 0.251213 0.290283 0.281767 0.239346 0.232208 0.260784 0.225475 0.230510 0.211922 0.231031 0.225306
chargesum: 0.00000
title: Mulliken charges with hydrogens summed into heavy atoms:
elementType: Cl O O N N C C C C C C C C C C C C
charge: -0.048003 -0.284238 -0.243478 -0.214263 -0.054690 0.284072 0.197727 0.104132 0.172066 -0.075978 -0.061402 -0.021464 0.109342 0.031398 -0.125827 0.241382 -0.010774
polarizability: 2.24143385e+02 8.69457509e+00 1.78185473e+02 6.06057539e+00 -6.48957266e+00 9.40195624e+01
1716.lowfreq: -5.0345 0.0022 0.0023 0.0026 3.2011 7.3065 44.6527 63.1296 84.0640
frequency: 44.5940 63.1201 84.0531 91.7320 100.7571 113.5686 166.8270 176.7636 188.2816 204.9963 249.1644 262.3773 274.0531 305.9621 328.7981 331.3350 379.4866 384.3371 410.4843 445.3210 469.6977 493.9577 532.4718 566.4793 604.6323 656.1368 678.7341 684.7139 744.4798 757.2778 788.9584 801.6349 820.2418 855.1925 902.2127 904.1189 950.8904 964.6446 1004.4334 1030.6460 1048.6056 1090.3433 1106.1252 1113.7679 1123.2236 1132.0156 1136.9428 1151.8023 1210.1983 1243.8324 1258.2872 1261.7858 1278.8112 1314.8121 1335.7069 1354.2865 1378.0087 1388.2628 1401.1990 1424.0109 1461.1360 1463.9479 1465.8803 1473.1996 1474.4243 1487.1936 1500.8193 1564.8057 1587.4038 1608.4097 1613.8572 2945.5186 2988.1483 2994.9583 3008.6971 3065.5946 3082.5082 3092.0925 3105.3953 3107.5069 3127.4940 3159.2441 3178.6489 3184.3104
redmass: 3.8683 6.5083 3.6906 2.2857 4.1423 4.5286 1.1786 2.4820 5.4131 4.7708 1.4074 4.0404 4.9664 4.7713 5.3028 4.5733 4.3200 3.9784 5.9080 4.3206 6.0212 3.9449 3.8888 4.6871 5.4906 5.8610 6.8802 6.9958 4.4892 5.9315 5.3304 1.0978 1.4773 3.7158 2.8312 1.6290 1.3425 2.3247 3.1319 3.6679 4.7218 2.1087 2.3424 1.8165 1.6649 2.5604 1.4722 1.4970 1.3736 1.1391 1.7162 2.1434 4.1928 2.2292 1.4642 1.6038 6.5105 3.4880 1.3065 1.1997 1.1042 1.0411 1.1447 1.2342 1.7629 1.0721 1.0649 8.1145 8.0823 8.0133 8.3031 1.0692 1.0384 1.0358 1.0585 1.1061 1.0953 1.0986 1.1023 1.0929 1.1022 1.0881 1.0968 1.0929
irintensity: 1.8102 1.2567 0.1832 2.3477 3.6045 2.1411 0.9846 2.3632 1.3585 0.7735 1.9930 6.3531 0.5612 5.6733 1.3479 0.7695 12.4458 0.9984 0.9707 3.3657 8.0296 6.0008 17.4899 21.3800 3.8051 1.9008 2.4852 6.4881 21.4428 29.4984 27.8540 3.4649 42.0070 23.4989 3.1836 19.0701 0.4850 19.4456 21.9576 86.6415 17.6512 15.7639 56.9088 12.1124 32.8489 60.7534 4.5536 22.5677 21.0328 0.8489 110.2563 172.2426 29.5892 82.0769 5.6401 0.4634 14.6826 37.3294 24.8161 31.7432 44.9269 10.3206 35.7742 58.6878 92.3189 9.5219 15.0075 11.2211 22.8719 30.7080 478.2803 36.9760 38.7250 22.0723 16.9577 7.1228 19.9303 29.0423 43.0723 12.6459 2.3897 2.8014 3.5414 2.1177
temp: 298.150 k
press: 1.00000 atm
elementType: 17 8 8 7 7 6 6 6 6 6 6 6 6 6 6 6 6 1 1 1 1 1 1 1 1 1 1 1 1 1
symmnumber: 1
zpe: 605973.1 jmol-1
zpe.correction: 0.230803 hartree
zpe.thermalcorrener: 0.246909 hartree
zpe.thermalcorrenthalpy: 0.247853 hartree
zpe.thermalcorrgfe: 0.186945 hartree
zpe.sumelectzpe: -1183.837105 hartree
zpe.sumelectthermal: -1183.820999 hartree
zpe.sumelectthermalent: -1183.820055 hartree
zpe.sumelectthermalfe: -1183.880963 hartree
dipole: 1.8041 -0.4109 0.5109
dipole: 1.9195
quadrupole: -129.4311 -89.3638 -104.2506
quadrupole: -8.9266 -1.1595 -3.1313
quadrupole: -21.7493 18.3180 3.4312 -8.9266 -1.1595 -3.1313
hfenergy: -1184.0679076 hartree
pointgroup: C01 [X(C12H13Cl1N2O2)]
dipole: 0.72642 -0.0549407 -0.1990535 debye
polarizability: 215.1275358|-20.122902|187.3756773|-7.5676294|-3.0045781|93.845207 unknown
InChI: InChI=1S/C12H13ClN2O2/c1-3-17-12-9-6-8(13)4-5-10(9)15(2)11(16)7-14-12/h4-6H,3,7H2,1-2H3
charge 0 multiplicity 1
30 atoms
Cl 4.434746 -1.338936 0.243067
O  -0.759438 -2.225687 -0.379156
O  -2.753884 2.750573 0.197788
N  -0.612538 2.002864 -0.347883
N  -1.931146 -0.542112 0.747698
C  0.541028 1.184721 -0.12189
C  0.469303 -0.232192 0.084981
C  -0.828034 -0.954114 0.182179
C  -1.818713 1.923906 0.385705
C  -1.912916 0.781612 1.404194
C  1.825502 1.792592 -0.210237
C  1.66716 -0.988874 0.183395
C  -0.502024 3.129772 -1.307541
C  3.00835 1.040875 -0.094607
C  2.911284 -0.351294 0.101899
C  -1.984713 -3.069102 -0.263222
C  -1.656096 -4.402426 -0.927178
H  -1.071278 0.871648 2.125791
H  -2.860001 0.92071 1.945066
H  1.901008 2.872283 -0.365518
H  1.593769 -2.071829 0.306578
H  -1.51944 3.386419 -1.639481
H  0.114749 2.823462 -2.167321
H  -0.066012 4.032018 -0.838866
H  3.985081 1.529163 -0.155716
H  -2.238314 -3.170799 0.808049
H  -2.818863 -2.538685 -0.756761
H  -2.535038 -5.070596 -0.875127
H  -1.390628 -4.259593 -1.988631
H  -0.811407 -4.900979 -0.420954
