program: Orca
programVersion: 4.2.1
elementType: Cl Cl O O O N N N C C C C C C C C C C C C C C C C C C C H H H H H H H H H H H H H H H H H
charge: 0
multiplicity: 1
keywords: wb97x-d3
keywords: def2-TZVPP
keywords: def2/J RIJCOSX GRIDX6 NOFINALGRIDX
keywords: grid4 nofinalgrid
keywords: scfconv7
keywords: smallprint printgap noloewdin
keywords: NOSOSCF
formula: C19H17Cl2N3O3
InChI: InChI=1S/C19H17Cl2N3O3/c1-13-9-25-19(27-13,10-24-12-22-11-23-24)17-7-6-16(8-18(17)21)26-15-4-2-14(20)3-5-15/h2-8,11-13H,9-10H2,1H3
44 atoms
Cl 1.055768 -1.434523 2.094241
Cl -6.98459 -0.033409 0.99996
O  3.769284 -1.087402 1.010197
O  4.144977 0.245449 -0.722437
O  -1.952087 -0.741101 -1.910547
N  2.521394 2.318656 0.655025
N  1.227545 2.541836 0.895915
N  2.004896 3.998395 -0.615603
C  3.235274 -0.010846 0.307004
C  4.489382 -1.910325 0.094101
C  3.208071 1.200007 1.246543
C  4.621453 -1.019051 -1.151867
C  1.846582 -0.294061 -0.262774
C  3.782304 -3.221567 -0.168634
C  0.818213 -0.882841 0.46859
C  1.534308 0.14012 -1.548028
C  -0.454993 -1.048742 -0.052046
C  0.26764 0.007209 -2.086714
C  -0.728522 -0.587058 -1.33092
C  2.970515 3.188765 -0.254196
C  0.962174 3.557742 0.116785
C  -3.091375 -0.564662 -1.177128
C  -4.161716 -1.398859 -1.464218
C  -3.216838 0.439729 -0.225367
C  -5.36598 -1.231448 -0.799729
C  -4.417439 0.599138 0.447997
C  -5.48433 -0.236787 0.157769
H  5.467704 -2.105424 0.540552
H  4.230226 1.489461 1.491956
H  2.696362 0.94902 2.173083
H  5.651579 -0.905135 -1.488355
H  4.026611 -1.404728 -1.987959
H  3.64849 -3.789265 0.752394
H  4.378972 -3.832428 -0.848395
H  2.802499 -3.071835 -0.625088
H  2.296694 0.614475 -2.150004
H  -1.22035 -1.530475 0.54224
H  0.0556 0.36549 -3.085508
H  3.989855 3.200424 -0.606793
H  -0.019629 4.003839 0.077805
H  -4.058681 -2.175954 -2.21065
H  -2.393566 1.105973 -0.000337
H  -6.19913 -1.882308 -1.027449
H  -4.513584 1.380245 1.189742
elementType: Cl O N C H
totalener: -2044.69667977 hartree
nucrepener: 2799.14562823 hartree
electener: -4843.84230800 hartree
oneelecener: -8369.34356993 hartree
twoeener: 3525.50126193 hartree
cpcmener: -0.02774065 hartree
kineticenergy: 2038.70154581 hartree
xcener: -149.988793580817 hartree
chargesum: 0.0000000
charge: -0.077868 -0.100022 -0.372678 -0.382090 -0.322507 0.108181 -0.331676 -0.404474 0.593585 0.187314 -0.086029 -0.048611 -0.225562 -0.298756 0.044075 -0.089141 -0.168524 -0.291918 0.287452 0.058322 0.062642 0.285537 -0.256475 -0.189175 -0.103912 -0.134978 0.065733 0.089140 0.128482 0.130493 0.113008 0.094302 0.091994 0.105752 0.081604 0.152208 0.131198 0.148480 0.170654 0.157939 0.148978 0.157095 0.145500 0.144726
qa: -0.0779 -0.1000 -0.3727 -0.3821 -0.3225 0.1082 -0.3317 -0.4045 0.5936 0.1873 -0.0860 -0.0486 -0.2256 -0.2988 0.0441 -0.0891 -0.1685 -0.2919 0.2875 0.0583 0.0626 0.2855 -0.2565 -0.1892 -0.1039 -0.1350 0.0657 0.0891 0.1285 0.1305 0.1130 0.0943 0.0920 0.1058 0.0816 0.1522 0.1312 0.1485 0.1707 0.1579 0.1490 0.1571 0.1455 0.1447
va: 1.2435 1.2036 2.0112 1.9838 2.0868 3.3666 2.8677 3.0373 3.8469 3.8635 3.8177 3.9594 3.5869 3.9697 3.9286 3.8138 4.0128 4.1256 3.7607 4.0669 4.0348 3.7002 4.0401 3.9403 3.9482 3.9802 3.8456 0.9999 1.0236 1.0257 0.9991 0.9954 1.0087 1.0079 0.9987 1.0162 1.0231 1.0071 1.0037 0.9967 1.0064 0.9985 1.0018 1.0041
dispcorr: -0.026523782 hartree
energy: -2044.723203551931
dipole: 27.74101 -25.83563 1.90538 -5.11559 3.64980 -1.46579 -10.89506 10.06803 -0.82702
magnitude: 2.54224 au
magnitude: 6.46185 debye
