program: Orca
programVersion: 4.2.1
elementType: Cl Cl O O O N N N C C C C C C C C C C C C C C C C C C C H H H H H H H H H H H H H H H H H
charge: 0
multiplicity: 1
keywords: wb97x-d3
keywords: def2-TZVPP
keywords: def2/J RIJCOSX GRIDX6 NOFINALGRIDX
keywords: grid4 nofinalgrid
keywords: scfconv7
keywords: smallprint printgap noloewdin
keywords: NOSOSCF
formula: C19H17Cl2N3O3
InChI: InChI=1S/C19H17Cl2N3O3/c1-13-9-25-19(27-13,10-24-12-22-11-23-24)17-7-6-16(8-18(17)21)26-15-4-2-14(20)3-5-15/h2-8,11-13H,9-10H2,1H3
44 atoms
Cl 0.863154 -0.325156 2.398187
Cl -6.901372 -2.193471 0.641408
O  3.457816 -1.031208 1.132436
O  4.05163 -0.072055 -0.779481
O  -2.160312 0.41132 -1.59849
N  3.159329 2.521248 0.375414
N  1.999398 3.118829 0.65521
N  2.996188 4.119148 -1.08151
C  3.188099 0.061745 0.311291
C  3.85499 -2.125802 0.309076
C  3.571652 1.333266 1.075992
C  4.155918 -1.460733 -1.044561
C  1.734482 0.101728 -0.156377
C  2.790055 -3.197454 0.234035
C  0.648119 -0.047936 0.700985
C  1.445572 0.3655 -1.492455
C  -0.662489 0.037086 0.257483
C  0.150019 0.442371 -1.968059
C  -0.907153 0.27427 -1.087528
C  3.740087 3.122742 -0.666673
C  1.94496 4.071334 -0.238784
C  -3.22905 -0.221621 -1.026454
C  -4.388403 0.518298 -0.852332
C  -3.195057 -1.569751 -0.693971
C  -5.525917 -0.090243 -0.345301
C  -4.327313 -2.175235 -0.173655
C  -5.485393 -1.432082 -0.002979
H  4.763426 -2.54402 0.749561
H  4.65228 1.352713 1.220408
H  3.100103 1.346174 2.055501
H  5.162326 -1.668604 -1.407054
H  3.442451 -1.773491 -1.815233
H  2.563984 -3.599202 1.221907
H  3.142184 -4.02448 -0.385131
H  1.864456 -2.821414 -0.204316
H  2.255587 0.509667 -2.193767
H  -1.474236 -0.069985 0.964706
H  -0.038833 0.638065 -3.015546
H  4.689023 2.812076 -1.074557
H  1.116943 4.761823 -0.284219
H  -4.408552 1.566866 -1.119752
H  -2.298622 -2.158937 -0.839763
H  -6.431433 0.486651 -0.215526
H  -4.301144 -3.224346 0.08731
elementType: Cl O N C H
totalener: -2044.69711002 hartree
nucrepener: 2783.50956615 hartree
electener: -4828.20667617 hartree
oneelecener: -8338.07680078 hartree
twoeener: 3509.87012461 hartree
cpcmener: -0.02903403 hartree
kineticenergy: 2038.70305476 hartree
xcener: -149.989309046300 hartree
chargesum: 0.0000000
charge: -0.078363 -0.098742 -0.371908 -0.381886 -0.318826 0.111685 -0.332643 -0.405395 0.593888 0.194484 -0.089907 -0.052974 -0.254150 -0.298948 0.048545 -0.081580 -0.172410 -0.293435 0.302890 0.057633 0.058990 0.285779 -0.248476 -0.203369 -0.105671 -0.122491 0.063986 0.088984 0.128349 0.131983 0.111474 0.094097 0.091838 0.104843 0.081706 0.151755 0.129902 0.147250 0.170057 0.159969 0.149926 0.159335 0.145776 0.146049
qa: -0.0784 -0.0987 -0.3719 -0.3819 -0.3188 0.1117 -0.3326 -0.4054 0.5939 0.1945 -0.0899 -0.0530 -0.2541 -0.2989 0.0485 -0.0816 -0.1724 -0.2934 0.3029 0.0576 0.0590 0.2858 -0.2485 -0.2034 -0.1057 -0.1225 0.0640 0.0890 0.1283 0.1320 0.1115 0.0941 0.0918 0.1048 0.0817 0.1518 0.1299 0.1473 0.1701 0.1600 0.1499 0.1593 0.1458 0.1460
va: 1.2438 1.2048 2.0158 1.9814 2.0935 3.3637 2.8782 3.0331 3.8382 3.8524 3.8116 3.9636 3.5982 3.9707 3.9276 3.8133 4.0042 4.1127 3.7563 4.0684 4.0427 3.6993 4.0482 3.9663 3.9454 3.9606 3.8513 0.9994 1.0240 1.0274 0.9996 0.9944 1.0086 1.0079 0.9984 1.0155 1.0253 1.0083 1.0038 0.9962 1.0056 0.9950 1.0018 1.0036
dispcorr: -0.026090084 hartree
energy: -2044.723200107933
dipole: 25.00320 -23.72303 1.28017 -4.59517 2.73488 -1.86028 -9.91533 9.23741 -0.67791
magnitude: 2.35776 au
magnitude: 5.99296 debye
