program: Gaussian 09
title: 000030289
version: EM64L-G09RevD.01
frameworkgroup: C1[X(C16H24N2O4)]
method: RPBEPBE
basis: SDD
operation: Freq
keyword: #p
keyword: freq=noraman
keyword: PBEPBE/SDD
title: #p freq=noraman PBEPBE/SDD
converged: YES YES NO NO
title: Mulliken charges:
elementType: O O O O N N C C C C C C C C C C C C C C C C H H H H H H H H H H H H H H H H H H H H H H H H
charge: -0.273931 -0.214699 -0.205282 -0.186481 -0.088341 0.016666 -0.397676 -0.383941 -0.327453 -0.261022 0.129733 0.224792 -0.679138 -0.692491 -0.478165 0.132103 0.245636 -0.360266 -0.333180 -0.341280 -0.247279 -0.688698 0.223709 0.224410 0.216359 0.220616 0.186021 0.240885 0.232603 0.248173 0.222088 0.218727 0.215392 0.226887 0.211303 0.210367 0.244160 0.217887 0.222969 0.219063 0.241889 0.282038 0.243835 0.205106 0.209642 0.226263
chargesum: 0.00000
title: Mulliken charges with hydrogens summed into heavy atoms:
elementType: O O O O N N C C C C C C C C C C C C C C C C
charge: -0.273931 -0.214699 -0.205282 -0.186481 -0.088341 0.016666 0.050444 0.053034 0.099453 0.219753 0.129733 0.224792 -0.022931 -0.043934 -0.016118 0.132103 0.245636 0.081766 -0.091291 -0.059242 -0.003444 -0.047687
polarizability: 3.50989997e+02 4.19634972e+01 2.55759180e+02 -7.71180467e+00 1.10890774e+01 1.38766728e+02
1716.lowfreq: -11.5335 -3.7650 -0.0007 -0.0005 0.0005 3.7276 11.2237 22.6147 27.6390
frequency: 2.6282 22.5683 27.6002 33.1561 44.9788 45.3437 57.5797 61.4042 71.0420 84.4107 102.3714 117.9530 151.3651 158.8194 168.4412 204.4272 212.5085 222.3427 223.9308 237.4673 254.9161 271.2729 279.4105 284.6286 321.8947 338.1947 361.9886 380.3104 400.6473 424.0401 458.1623 482.0106 493.1646 536.7928 567.0091 587.9204 599.5175 658.0135 690.2650 725.4435 740.4697 750.1246 755.1013 773.5154 785.7296 796.5499 808.7762 825.2648 830.8510 875.2781 892.7614 899.7629 906.6281 932.4863 973.0588 983.9524 1021.5347 1040.8299 1054.8406 1063.0771 1066.3090 1075.8667 1084.0011 1089.2216 1094.6542 1112.1571 1117.7572 1145.9183 1158.3338 1184.4524 1201.7727 1207.7649 1217.0394 1219.7440 1235.9999 1243.3373 1278.0510 1281.0633 1295.2650 1297.3110 1321.5827 1335.5747 1341.7329 1347.4106 1353.2128 1361.3984 1374.6862 1377.1592 1381.9763 1386.8186 1393.5671 1420.7808 1432.7798 1448.7454 1458.1198 1463.5247 1466.5497 1471.8786 1473.3445 1477.0141 1478.2452 1480.2691 1484.5205 1490.2993 1498.0037 1560.8376 1589.5459 1601.2476 2868.6090 2947.1130 2955.5643 2973.2712 2977.0051 2981.2700 2992.6378 3005.3829 3011.5682 3029.5265 3039.2888 3039.8772 3047.8372 3048.6617 3072.9365 3074.7462 3076.5134 3078.0011 3080.4272 3087.6331 3121.9356 3149.2664 3165.7476 3182.6242
redmass: 3.2254 4.2378 5.0339 4.4318 3.9065 2.9075 2.4261 2.7349 3.3442 3.1975 3.7286 3.4503 3.6884 1.7015 4.1748 1.6654 2.1121 1.1573 2.2993 4.1294 5.7026 1.5443 3.2888 2.9957 4.4993 8.6214 3.7511 6.6485 2.2790 5.1639 4.2067 2.9770 3.5453 3.5129 2.7289 6.1548 5.3007 8.2605 5.3274 4.3353 1.6300 2.6404 2.6724 1.1317 1.8645 1.1660 1.5010 2.3997 5.1713 1.5122 3.1093 2.6927 2.3336 1.4054 2.5093 1.3648 3.2547 2.2191 2.7444 1.7081 2.2804 1.6406 2.1383 2.7707 2.0244 1.6656 2.6207 1.3304 2.3158 1.5072 3.1914 2.0810 1.5022 4.9311 1.7459 1.7564 1.1372 1.3040 1.3776 1.2313 1.3715 1.3646 1.2685 2.1967 3.7710 2.9023 1.2603 1.5498 1.4588 1.3401 1.2156 2.2090 1.1542 2.4990 1.0781 1.1104 1.0485 1.0552 1.0610 1.0600 1.0433 1.0492 1.0759 1.0757 1.0801 6.6199 6.5797 8.9601 1.0714 1.0658 1.0627 1.0363 1.0350 1.0361 1.0605 1.0619 1.0942 1.0881 1.0802 1.0760 1.0958 1.0999 1.0992 1.0985 1.1000 1.1007 1.1010 1.1004 1.1111 1.0869 1.0921 1.0988
irintensity: 0.4029 0.3402 0.4186 2.7971 1.2865 1.0146 0.1337 0.5212 0.7022 0.5156 2.6678 0.2251 1.8722 0.9369 0.4696 0.7585 2.3302 0.0753 1.7560 0.3482 0.2677 1.2003 4.1088 6.5025 8.8469 2.6709 0.6262 2.0894 3.8050 0.2244 0.5288 18.1418 4.1812 5.4024 0.0971 1.3040 1.9919 35.4974 9.4128 8.2405 4.9181 17.7225 27.7697 1.5942 45.8870 19.4035 14.8846 0.6943 1.1094 4.8285 86.9736 37.2584 52.4571 2.2883 8.7116 1.5294 37.5023 4.4707 0.6947 6.3110 31.7972 14.3537 69.3379 23.3037 30.1769 43.7545 5.5640 16.2086 67.0990 48.5392 160.6822 13.3586 63.1722 154.3336 49.8020 48.7297 2.7735 24.6111 27.3009 20.6312 13.0022 2.5299 12.8991 5.1978 36.3225 30.2759 36.2905 10.0263 21.0170 73.4321 8.0619 47.7276 47.0916 38.9500 7.7180 14.7682 21.6787 4.1414 8.8152 7.4606 13.3459 8.0394 14.3114 11.0941 6.1385 102.4114 6.6447 112.9009 125.0763 40.3654 18.0255 39.2176 44.0133 35.2842 59.3285 14.5176 6.9493 1.2247 30.7485 4.8876 18.2803 1.0251 38.2815 76.7514 50.1846 62.4900 41.8054 50.3475 10.8911 4.7723 7.6018 7.8541
temp: 298.150 k
press: 1.00000 atm
elementType: 8 8 8 8 7 7 6 6 6 6 6 6 6 6 6 6 6 6 6 6 6 6 1 1 1 1 1 1 1 1 1 1 1 1 1 1 1 1 1 1 1 1 1 1 1 1
symmnumber: 1
zpe: 992666.2 jmol-1
zpe.correction: 0.378087 hartree
zpe.thermalcorrener: 0.402773 hartree
zpe.thermalcorrenthalpy: 0.403717 hartree
zpe.thermalcorrgfe: 0.317955 hartree
zpe.sumelectzpe: -1032.675225 hartree
zpe.sumelectthermal: -1032.650538 hartree
zpe.sumelectthermalent: -1032.649594 hartree
zpe.sumelectthermalfe: -1032.735357 hartree
dipole: -2.5076 4.7734 1.2724
dipole: 5.5401
quadrupole: -108.7249 -145.8870 -133.6338
quadrupole: -8.1184 -8.1299 -4.7618
quadrupole: 20.6903 -16.4718 -4.2185 -8.1184 -8.1299 -4.7618
hfenergy: -1033.0533115 hartree
pointgroup: C01 [X(C16H24N2O4)]
dipole: -0.7278632 1.9402229 0.6757389 debye
polarizability: 359.5214818|29.8352756|244.3016149|-9.6542884|19.5852695|141.692808 unknown
InChI: InChI=1S/C16H24N2O4/c1-4-8-15(19)13-9-7-10-14(18(20)21)16(13)22-12-11-17(5-2)6-3/h7,9-10H,4-6,8,11-12H2,1-3H3
charge 0 multiplicity 1
46 atoms
O  -0.080619 -0.694502 -0.574379
O  0.314986 1.891736 0.593628
O  -2.720738 -3.758769 -0.92963
O  -0.589852 -3.406341 -0.199398
N  3.579759 -0.655972 0.17822
N  -1.806417 -3.022537 -0.38356
C  2.351622 -0.627471 -0.646738
C  4.705089 -1.433978 -0.388555
C  3.920485 0.657859 0.779463
C  1.154347 -0.942765 0.25809
C  -1.306176 -0.573663 0.051501
C  -1.798283 0.703118 0.497999
C  5.398959 -0.814542 -1.633256
C  4.821429 0.539997 2.023143
C  -1.639656 3.283599 0.182656
C  -0.937954 1.94347 0.441377
C  -2.213137 -1.678476 0.085906
C  -0.664411 4.436679 -0.126598
C  -3.134454 0.806686 0.965895
C  -3.54202 -1.553535 0.544129
C  -3.998574 -0.307062 1.006716
C  -1.401624 5.774494 -0.343751
H  2.181703 0.356176 -1.13532
H  2.415199 -1.386857 -1.446924
H  5.456171 -1.592321 0.407677
H  4.317213 -2.436975 -0.649382
H  4.400782 1.341604 0.035553
H  2.969068 1.142274 1.066999
H  1.131683 -0.261603 1.123995
H  1.143996 -1.998578 0.572293
H  4.679136 -0.668488 -2.459802
H  5.855145 0.164551 -1.399414
H  6.201917 -1.483163 -1.996177
H  4.35655 -0.130102 2.767898
H  5.821619 0.13931 1.776911
H  4.966214 1.534655 2.4840
H  -2.369849 3.154016 -0.641477
H  -2.244416 3.547014 1.077602
H  0.063747 4.527623 0.699884
H  -0.071468 4.177914 -1.024007
H  -3.505443 1.777497 1.308977
H  -4.190288 -2.434109 0.523904
H  -5.019803 -0.200826 1.38371
H  -1.971463 6.070448 0.557712
H  -2.115572 5.710404 -1.186706
H  -0.687904 6.586911 -0.570265
