program: Orca
programVersion: 4.2.1
elementType: Cl Cl O O O N N N C C C C C C C C C C C C C C C C C C C H H H H H H H H H H H H H H H H H
charge: 0
multiplicity: 1
keywords: wb97x-d3
keywords: def2-TZVPP
keywords: def2/J RIJCOSX GRIDX6 NOFINALGRIDX
keywords: grid4 nofinalgrid
keywords: scfconv7
keywords: smallprint printgap noloewdin
keywords: NOSOSCF
formula: C19H17Cl2N3O3
InChI: InChI=1S/C19H17Cl2N3O3/c1-13-9-25-19(27-13,10-24-12-22-11-23-24)17-7-6-16(8-18(17)21)26-15-4-2-14(20)3-5-15/h2-8,11-13H,9-10H2,1H3
44 atoms
Cl 0.406046 -0.191594 1.995795
Cl -7.613605 -0.813108 0.866254
O  3.08141 -0.284474 0.78582
O  3.421488 0.484065 -1.300404
O  -2.516715 -1.456534 -1.940673
N  3.691922 2.514707 0.613899
N  4.11323 2.476305 1.881528
N  5.72072 3.293402 0.547166
C  2.531579 0.511894 -0.216999
C  4.366552 -0.737518 0.395054
C  2.416106 1.978152 0.230201
C  4.297278 -0.607245 -1.11841
C  1.162694 -0.020929 -0.623637
C  4.598139 -2.141327 0.901675
C  0.16687 -0.356878 0.291557
C  0.853091 -0.163759 -1.972984
C  -1.071814 -0.830537 -0.114246
C  -0.377228 -0.624111 -2.403817
C  -1.343053 -0.962079 -1.468512
C  4.667973 2.998699 -0.1700
C  5.330035 2.953847 1.794856
C  -3.675659 -1.277447 -1.241372
C  -4.059826 -0.032137 -0.760497
C  -4.504459 -2.375919 -1.076576
C  -5.272368 0.107808 -0.107016
C  -5.723293 -2.233224 -0.433095
C  -6.100136 -0.992712 0.054534
H  5.135312 -0.06688 0.800646
H  1.743406 2.067469 1.080242
H  2.008163 2.571312 -0.58983
H  5.256082 -0.368356 -1.578424
H  3.899015 -1.519208 -1.582122
H  4.563013 -2.17336 1.989604
H  5.582075 -2.49597 0.592446
H  3.846261 -2.829582 0.514604
H  1.597588 0.097022 -2.711684
H  -1.808927 -1.097454 0.631048
H  -0.589837 -0.726065 -3.459364
H  4.562265 3.120726 -1.236407
H  5.957963 3.0700 2.664313
H  -3.421374 0.831511 -0.894823
H  -4.198546 -3.340589 -1.45891
H  -5.574515 1.075323 0.268796
H  -6.372499 -3.08833 -0.306712
totalener: -2044.66944776 hartree
nucrepener: 2707.29002717 hartree
electener: -4751.95947492 hartree
oneelecener: -8184.77479954 hartree
twoeener: 3432.81532462 hartree
kineticenergy: 2038.71115526 hartree
xcener: -149.987623475065 hartree
chargesum: 0.0000000
charge: -0.049024 -0.076757 -0.329317 -0.376521 -0.295977 0.102769 -0.296165 -0.327640 0.560257 0.124305 -0.135274 0.002208 -0.111924 -0.264122 -0.035548 -0.081448 -0.159836 -0.230998 0.239656 0.030425 0.045751 0.248435 -0.178226 -0.216348 -0.103814 -0.085671 0.057777 0.067977 0.134761 0.120807 0.101141 0.079721 0.101928 0.081486 0.076518 0.136914 0.124830 0.128902 0.141364 0.130010 0.137041 0.130241 0.125272 0.124116
qa: -0.0490 -0.0768 -0.3293 -0.3765 -0.2960 0.1028 -0.2962 -0.3276 0.5603 0.1243 -0.1353 0.0022 -0.1119 -0.2641 -0.0355 -0.0814 -0.1598 -0.2310 0.2397 0.0304 0.0458 0.2484 -0.1782 -0.2163 -0.1038 -0.0857 0.0578 0.0680 0.1348 0.1208 0.1011 0.0797 0.1019 0.0815 0.0765 0.1369 0.1248 0.1289 0.1414 0.1300 0.1370 0.1302 0.1253 0.1241
va: 1.2758 1.2277 2.0485 1.9893 2.1150 3.3625 2.8572 3.0559 3.8420 3.9470 3.8194 3.9328 3.6609 3.9716 4.1162 3.8793 3.9579 4.0683 3.8591 4.0806 4.0466 3.8125 3.9776 4.0557 3.9808 3.9640 3.9465 0.9949 1.0328 1.0081 1.0010 1.0014 1.0049 1.0058 1.0129 1.0263 1.0259 1.0153 1.0104 1.0026 1.0008 1.0122 1.0102 1.0093
dispcorr: -0.024266999 hartree
energy: -2044.693714756678
dipole: 30.64771 -30.86129 -0.21357 -3.11958 2.26133 -0.85825 -8.90734 7.73671 -1.17062
magnitude: 1.46716 au
magnitude: 3.72923 debye
