program: Orca
programVersion: 4.2.1
elementType: Cl Cl O O O N N N C C C C C C C C C C C C C C C C C C C H H H H H H H H H H H H H H H H H
charge: 0
multiplicity: 1
keywords: wb97x-d3
keywords: def2-TZVPP
keywords: def2/J RIJCOSX GRIDX6 NOFINALGRIDX
keywords: grid4 nofinalgrid
keywords: scfconv7
keywords: smallprint printgap noloewdin
keywords: NOSOSCF
formula: C19H17Cl2N3O3
InChI: InChI=1S/C19H17Cl2N3O3/c1-13-9-25-19(27-13,10-24-12-22-11-23-24)17-7-6-16(8-18(17)21)26-15-4-2-14(20)3-5-15/h2-8,11-13H,9-10H2,1H3
44 atoms
Cl 0.188061 0.876942 1.835435
Cl -7.093509 -2.506608 0.983511
O  2.873494 0.019668 0.980117
O  3.506484 0.215199 -1.141747
O  -2.660441 -0.342621 -2.16749
N  4.125036 2.479325 0.466013
N  4.339909 2.726008 1.761459
N  6.278328 2.721587 0.63384
C  2.581071 0.68286 -0.202756
C  3.440881 -1.241647 0.677148
C  2.809177 2.186328 -0.026273
C  3.775972 -1.131974 -0.821704
C  1.152926 0.417918 -0.678264
C  2.497831 -2.382427 1.002324
C  0.042512 0.46735 0.162675
C  0.912753 0.133498 -2.020259
C  -1.239863 0.211562 -0.299714
C  -0.353249 -0.134733 -2.5053
C  -1.434209 -0.103719 -1.636898
C  5.295175 2.473658 -0.191462
C  5.640203 2.866383 1.815654
C  -3.661461 -0.848011 -1.386805
C  -3.486403 -2.001122 -0.632624
C  -4.89023 -0.208456 -1.413322
C  -4.544833 -2.508923 0.101041
C  -5.953083 -0.723155 -0.688097
C  -5.774474 -1.868304 0.070559
H  4.350898 -1.336136 1.2763
H  2.093085 2.597529 0.681773
H  2.653886 2.67998 -0.987076
H  4.823395 -1.338383 -1.042957
H  3.155292 -1.811798 -1.418647
H  2.978266 -3.340581 0.796468
H  1.585204 -2.327798 0.40692
H  2.219371 -2.369713 2.055174
H  1.747197 0.106913 -2.707327
H  -2.073244 0.268387 0.387343
H  -0.507424 -0.36555 -3.550651
H  5.376771 2.295365 -1.251791
H  6.149735 3.087572 2.740307
H  -2.530349 -2.508492 -0.61671
H  -5.016682 0.686949 -2.007211
H  -4.413764 -3.406198 0.689732
H  -6.913976 -0.228257 -0.70949
totalener: -2044.66750577 hartree
nucrepener: 2724.37838671 hartree
electener: -4769.04589249 hartree
oneelecener: -8218.80709102 hartree
twoeener: 3449.76119854 hartree
kineticenergy: 2038.72095982 hartree
xcener: -149.989587441033 hartree
chargesum: -0.0000000
charge: -0.043535 -0.075229 -0.324382 -0.364247 -0.294588 0.108644 -0.291676 -0.338030 0.584870 0.184445 -0.123867 -0.053158 -0.222477 -0.291046 -0.006106 -0.085776 -0.160326 -0.237248 0.247398 0.037844 0.051647 0.235195 -0.169611 -0.206017 -0.107486 -0.091450 0.061926 0.083709 0.133698 0.126503 0.097969 0.085652 0.091690 0.074687 0.101137 0.139624 0.122675 0.130036 0.139311 0.129494 0.136448 0.130968 0.125233 0.125453
qa: -0.0435 -0.0752 -0.3244 -0.3642 -0.2946 0.1086 -0.2917 -0.3380 0.5849 0.1844 -0.1239 -0.0532 -0.2225 -0.2910 -0.0061 -0.0858 -0.1603 -0.2372 0.2474 0.0378 0.0516 0.2352 -0.1696 -0.2060 -0.1075 -0.0915 0.0619 0.0837 0.1337 0.1265 0.0980 0.0857 0.0917 0.0747 0.1011 0.1396 0.1227 0.1300 0.1393 0.1295 0.1364 0.1310 0.1252 0.1255
va: 1.2808 1.2295 2.0406 1.9904 2.1162 3.3598 2.8807 3.0621 3.8346 3.8669 3.7940 3.9597 3.6218 3.9695 4.0644 3.8982 3.9517 4.0751 3.8467 4.0873 4.0607 3.8233 3.9791 4.0538 3.9850 3.9677 3.9488 0.9962 1.0332 1.0051 1.0014 0.9956 1.0102 0.9989 1.0094 1.0230 1.0297 1.0151 1.0122 1.0015 1.0020 1.0116 1.0106 1.0090
dispcorr: -0.024763257 hartree
energy: -2044.692269030985
dipole: 24.15594 -24.92607 -0.77013 -4.61467 3.49695 -1.11772 -8.51436 7.28761 -1.22675
magnitude: 1.82957 au
magnitude: 4.65040 debye
