program: Orca
programVersion: 4.2.1
elementType: Cl Cl O O O N N N C C C C C C C C C C C C C C C C C C C H H H H H H H H H H H H H H H H H
charge: 0
multiplicity: 1
keywords: wb97x-d3
keywords: def2-TZVPP
keywords: def2/J RIJCOSX GRIDX6 NOFINALGRIDX
keywords: grid4 nofinalgrid
keywords: scfconv7
keywords: smallprint printgap noloewdin
keywords: NOSOSCF
formula: C19H17Cl2N3O3
InChI: InChI=1S/C19H17Cl2N3O3/c1-13-9-25-19(27-13,10-24-12-22-11-23-24)17-7-6-16(8-18(17)21)26-15-4-2-14(20)3-5-15/h2-8,11-13H,9-10H2,1H3
44 atoms
Cl 0.22755 0.775717 1.885308
Cl -7.138811 -2.549136 1.054536
O  2.839923 -0.091235 0.870112
O  3.41667 0.261231 -1.267412
O  -2.798794 -0.160411 -2.063295
N  4.111028 2.386805 0.49285
N  5.112009 2.7222 -0.326273
N  5.87283 2.435023 1.764517
C  2.534617 0.664873 -0.267732
C  3.780886 -1.104269 0.541173
C  2.781622 2.154268 0.005464
C  3.787174 -1.066527 -0.982009
C  1.0855 0.440889 -0.689666
C  3.363838 -2.43041 1.133457
C  0.01062 0.45923 0.196486
C  0.787955 0.236096 -2.034204
C  -1.294051 0.253121 -0.22571
C  -0.501494 0.017207 -2.480959
C  -1.546657 0.018741 -1.569874
C  4.584531 2.211357 1.736374
C  6.145406 2.743155 0.477702
C  -3.773648 -0.721354 -1.288824
C  -3.571754 -1.913696 -0.605444
C  -5.009289 -0.094868 -1.252721
C  -4.609579 -2.473406 0.120135
C  -6.051168 -0.661131 -0.535889
C  -5.84564 -1.845623 0.152444
H  4.76375 -0.813409 0.932088
H  2.061886 2.519761 0.73737
H  2.648943 2.72521 -0.91215
H  4.767276 -1.258103 -1.417641
H  3.068671 -1.784434 -1.401414
H  4.087262 -3.204165 0.872596
H  2.385222 -2.73651 0.762155
H  3.315452 -2.378401 2.220233
H  1.594645 0.237305 -2.753862
H  -2.09901 0.285181 0.496025
H  -0.70142 -0.149962 -3.530626
H  3.959567 1.932187 2.570097
H  7.133237 2.996903 0.126412
H  -2.611545 -2.412277 -0.638936
H  -5.157431 0.830968 -1.792419
H  -4.457367 -3.401622 0.653092
H  -7.017064 -0.176235 -0.509473
totalener: -2044.66950577 hartree
nucrepener: 2713.56813745 hartree
electener: -4758.23764322 hartree
oneelecener: -8197.12261094 hartree
twoeener: 3438.88496772 hartree
kineticenergy: 2038.71578099 hartree
xcener: -149.988415330240 hartree
chargesum: -0.0000000
charge: -0.063361 -0.076038 -0.358249 -0.332942 -0.294879 0.118126 -0.298367 -0.334841 0.571852 0.140484 -0.142837 -0.017540 -0.145450 -0.261142 -0.026756 -0.083820 -0.164807 -0.226414 0.240911 0.022165 0.051949 0.241135 -0.173005 -0.211204 -0.106228 -0.089260 0.059155 0.074888 0.140532 0.121603 0.101512 0.076538 0.085769 0.073889 0.096828 0.141757 0.123897 0.130488 0.146125 0.129614 0.136466 0.130907 0.125342 0.125204
qa: -0.0634 -0.0760 -0.3582 -0.3329 -0.2949 0.1181 -0.2984 -0.3348 0.5719 0.1405 -0.1428 -0.0175 -0.1454 -0.2611 -0.0268 -0.0838 -0.1648 -0.2264 0.2409 0.0222 0.0519 0.2411 -0.1730 -0.2112 -0.1062 -0.0893 0.0592 0.0749 0.1405 0.1216 0.1015 0.0765 0.0858 0.0739 0.0968 0.1418 0.1239 0.1305 0.1461 0.1296 0.1365 0.1309 0.1253 0.1252
va: 1.2590 1.2286 2.0127 2.0419 2.1164 3.3480 2.8832 3.0544 3.8481 3.8985 3.8100 3.9560 3.6535 3.9722 4.0714 3.8841 3.9633 4.0572 3.8574 4.0747 4.0542 3.8174 3.9756 4.0536 3.9825 3.9656 3.9483 0.9993 1.0121 1.0292 1.0013 0.9967 1.0069 1.0096 1.0067 1.0237 1.0260 1.0148 1.0112 1.0015 1.0013 1.0120 1.0104 1.0089
dispcorr: -0.024377153 hartree
energy: -2044.693882922096
dipole: 26.07228 -26.85927 -0.78699 -3.90418 2.90053 -1.00364 -7.25016 6.58543 -0.66473
magnitude: 1.43824 au
magnitude: 3.65571 debye
