program: Orca
programVersion: 4.2.1
elementType: Cl Cl O O O N N N C C C C C C C C C C C C C C C C C C C H H H H H H H H H H H H H H H H H
charge: 0
multiplicity: 1
keywords: wb97x-d3
keywords: def2-TZVPP
keywords: def2/J RIJCOSX GRIDX6 NOFINALGRIDX
keywords: grid4 nofinalgrid
keywords: scfconv7
keywords: smallprint printgap noloewdin
keywords: NOSOSCF
formula: C19H17Cl2N3O3
InChI: InChI=1S/C19H17Cl2N3O3/c1-13-9-25-19(27-13,10-24-12-22-11-23-24)17-7-6-16(8-18(17)21)26-15-4-2-14(20)3-5-15/h2-8,11-13H,9-10H2,1H3
44 atoms
Cl 1.326097 -0.144228 -2.659816
Cl -6.559814 1.603795 -0.657257
O  4.048848 -0.367223 0.929958
O  3.935664 -0.465967 -1.292518
O  -2.051195 -1.900572 0.644036
N  2.057727 2.029607 0.540036
N  2.151798 2.098372 1.870952
N  0.053171 2.537084 1.211066
C  3.247822 -0.025868 -0.164372
C  4.92292 -1.425989 0.556482
C  3.127734 1.509858 -0.265277
C  4.5597 -1.667439 -0.911696
C  1.863005 -0.655927 -0.024333
C  4.752439 -2.640747 1.441742
C  0.933003 -0.694228 -1.062545
C  1.429654 -1.079064 1.227865
C  -0.369747 -1.115671 -0.861681
C  0.131921 -1.502141 1.455142
C  -0.771431 -1.502901 0.408404
C  0.795183 2.281593 0.164417
C  0.93197 2.411376 2.230337
C  -3.064714 -1.040112 0.325282
C  -2.939087 0.338692 0.445366
C  -4.262751 -1.603132 -0.088519
C  -4.020115 1.14992 0.139458
C  -5.34315 -0.789288 -0.384558
C  -5.215675 0.58607 -0.275366
H  5.950058 -1.054624 0.641974
H  2.931264 1.783432 -1.300768
H  4.067331 1.966974 0.041466
H  5.425334 -1.833539 -1.552459
H  3.878012 -2.521748 -1.018483
H  3.744075 -3.049735 1.368688
H  4.951377 -2.399796 2.485351
H  5.454648 -3.421577 1.145164
H  2.117735 -1.033207 2.058973
H  -1.071182 -1.122324 -1.685413
H  -0.185919 -1.80246 2.444244
H  0.47293 2.271543 -0.865845
H  0.664109 2.562044 3.264168
H  -2.01811 0.799936 0.783007
H  -4.349219 -2.678058 -0.174289
H  -3.925018 2.222541 0.234738
H  -6.277779 -1.226069 -0.707471
totalener: -2044.66623083 hartree
nucrepener: 2839.90933993 hartree
electener: -4884.57557076 hartree
oneelecener: -8450.27332877 hartree
twoeener: 3565.69775801 hartree
kineticenergy: 2038.72701469 hartree
xcener: -149.992008219848 hartree
chargesum: 0.0000000
charge: -0.059135 -0.085302 -0.345911 -0.321555 -0.303586 0.122361 -0.298879 -0.355978 0.587321 0.119231 -0.131251 0.002074 -0.097066 -0.281495 -0.074309 -0.169462 -0.099583 -0.178044 0.186268 0.049538 0.066308 0.182088 -0.101816 -0.181059 -0.183990 -0.114146 0.096339 0.070137 0.133968 0.109393 0.099361 0.074317 0.078811 0.100086 0.091732 0.152960 0.124763 0.128921 0.144107 0.129669 0.154946 0.127641 0.128953 0.121271
qa: -0.0591 -0.0853 -0.3459 -0.3216 -0.3036 0.1224 -0.2989 -0.3560 0.5873 0.1192 -0.1313 0.0021 -0.0971 -0.2815 -0.0743 -0.1695 -0.0996 -0.1780 0.1863 0.0495 0.0663 0.1821 -0.1018 -0.1811 -0.1840 -0.1141 0.0963 0.0701 0.1340 0.1094 0.0994 0.0743 0.0788 0.1001 0.0917 0.1530 0.1248 0.1289 0.1441 0.1297 0.1549 0.1276 0.1290 0.1213
va: 1.2662 1.2194 2.0243 2.0508 2.0989 3.3238 2.8717 3.0082 3.8048 3.9471 3.8517 3.9513 3.5841 3.9501 3.9965 3.8733 3.9762 4.0616 3.9181 4.0297 4.0317 3.8298 3.8537 4.0085 4.0689 4.0057 3.8912 0.9990 1.0083 1.0312 0.9950 1.0023 1.0048 1.0053 1.0097 1.0239 1.0215 1.0116 1.0078 1.0023 1.0164 1.0125 1.0129 1.0104
dispcorr: -0.027930214 hartree
energy: -2044.694161043178
dipole: 27.62914 -26.16496 1.46418 -11.88355 10.73732 -1.14623 11.28902 -11.53061 -0.24158
magnitude: 1.87510 au
magnitude: 4.76614 debye
