program: Orca
programVersion: 4.2.1
elementType: Cl Cl O O O N N N C C C C C C C C C C C C C C C C C C C H H H H H H H H H H H H H H H H H
charge: 0
multiplicity: 1
keywords: wb97x-d3
keywords: def2-TZVPP
keywords: def2/J RIJCOSX GRIDX6 NOFINALGRIDX
keywords: grid4 nofinalgrid
keywords: scfconv7
keywords: smallprint printgap noloewdin
keywords: NOSOSCF
formula: C19H17Cl2N3O3
InChI: InChI=1S/C19H17Cl2N3O3/c1-13-9-25-19(27-13,10-24-12-22-11-23-24)17-7-6-16(8-18(17)21)26-15-4-2-14(20)3-5-15/h2-8,11-13H,9-10H2,1H3
44 atoms
Cl 1.892554 -1.263576 2.477132
Cl -7.654743 -0.02046 -1.669609
O  3.505816 -0.20743 0.267844
O  2.615635 1.100884 -1.295561
O  -2.576808 -2.038967 0.429374
N  3.70823 2.5514 0.872105
N  3.820859 3.660801 0.136207
N  5.801276 3.111207 1.034088
C  2.428215 0.636792 0.002365
C  3.992674 -0.740918 -0.954122
C  2.469741 1.832027 0.957901
C  3.223048 0.056528 -2.019192
C  1.090463 -0.089961 0.138136
C  3.770865 -2.236038 -1.041146
C  0.777769 -0.949433 1.19082
C  0.09534 0.128471 -0.809613
C  -0.454648 -1.574839 1.279814
C  -1.142117 -0.488257 -0.749438
C  -1.413551 -1.350671 0.303401
C  4.902163 2.233352 1.395886
C  5.088484 3.962508 0.265164
C  -3.733977 -1.522364 -0.081689
C  -4.504022 -2.335333 -0.897361
C  -4.168716 -0.245484 0.248255
C  -5.717952 -1.875881 -1.383274
C  -5.376507 0.217524 -0.245296
C  -6.146771 -0.599246 -1.059341
H  5.063581 -0.521599 -1.000297
H  2.318632 1.485721 1.980281
H  1.664228 2.522437 0.713831
H  3.869167 0.49266 -2.780828
H  2.474432 -0.572452 -2.518073
H  4.271999 -2.756959 -0.226526
H  4.172991 -2.622607 -1.979244
H  2.708935 -2.48246 -1.002144
H  0.297301 0.801555 -1.631667
H  -0.673286 -2.238302 2.105313
H  -1.875658 -0.29716 -1.521055
H  5.057987 1.37158 2.025278
H  5.516921 4.831644 -0.208855
H  -4.158015 -3.330135 -1.144289
H  -3.574224 0.388464 0.893416
H  -6.322964 -2.509577 -2.016413
H  -5.720913 1.209726 0.010868
totalener: -2044.66884867 hartree
nucrepener: 2702.07288432 hartree
electener: -4746.74173299 hartree
oneelecener: -8174.07696850 hartree
twoeener: 3427.33523551 hartree
kineticenergy: 2038.72364382 hartree
xcener: -149.990189161668 hartree
chargesum: -0.0000000
charge: -0.061460 -0.075159 -0.356507 -0.331961 -0.297301 0.111157 -0.299487 -0.338757 0.598688 0.173044 -0.128692 -0.042366 -0.204660 -0.282236 0.014985 -0.116369 -0.201585 -0.180865 0.223355 0.037537 0.054543 0.234297 -0.206941 -0.165507 -0.090193 -0.108938 0.061261 0.081111 0.138187 0.120774 0.099006 0.081768 0.096058 0.090927 0.077927 0.145473 0.121304 0.137419 0.142936 0.128662 0.131318 0.137213 0.123951 0.126082
qa: -0.0615 -0.0752 -0.3565 -0.3320 -0.2973 0.1112 -0.2995 -0.3388 0.5987 0.1730 -0.1287 -0.0424 -0.2047 -0.2822 0.0150 -0.1164 -0.2016 -0.1809 0.2234 0.0375 0.0545 0.2343 -0.2069 -0.1655 -0.0902 -0.1089 0.0613 0.0811 0.1382 0.1208 0.0990 0.0818 0.0961 0.0909 0.0779 0.1455 0.1213 0.1374 0.1429 0.1287 0.1313 0.1372 0.1240 0.1261
va: 1.2568 1.2293 2.0023 2.0394 2.1101 3.3531 2.8821 3.0608 3.8266 3.8607 3.7994 3.9637 3.6447 3.9770 3.9972 3.9425 4.1072 3.9637 3.8829 4.0801 4.0603 3.8229 4.0503 3.9784 3.9656 3.9811 3.9437 1.0001 1.0120 1.0277 1.0001 0.9938 1.0094 1.0093 1.0007 1.0238 1.0293 1.0059 1.0118 1.0016 1.0113 1.0014 1.0094 1.0102
dispcorr: -0.024487857 hartree
energy: -2044.693336527882
dipole: 22.13388 -22.97924 -0.84536 -2.31101 0.98833 -1.32269 -8.79506 8.17940 -0.61566
magnitude: 1.68617 au
magnitude: 4.28590 debye
