program: Orca
programVersion: 4.2.1
elementType: Cl Cl O O O N N N C C C C C C C C C C C C C C C C C C C H H H H H H H H H H H H H H H H H
charge: 0
multiplicity: 1
keywords: wb97x-d3
keywords: def2-TZVPP
keywords: def2/J RIJCOSX GRIDX6 NOFINALGRIDX
keywords: grid4 nofinalgrid
keywords: scfconv7
keywords: smallprint printgap noloewdin
keywords: NOSOSCF
formula: C19H17Cl2N3O3
InChI: InChI=1S/C19H17Cl2N3O3/c1-13-9-25-19(27-13,10-24-12-22-11-23-24)17-7-6-16(8-18(17)21)26-15-4-2-14(20)3-5-15/h2-8,11-13H,9-10H2,1H3
44 atoms
Cl 2.637309 0.025891 -2.853894
Cl -6.935053 -1.569215 1.274076
O  3.165224 -0.602278 1.5853
O  3.95501 -1.071543 -0.445951
O  -2.185797 0.198144 -1.655028
N  2.986636 2.278219 0.587668
N  2.740405 2.510168 1.879409
N  1.507274 3.870567 0.589202
C  3.161371 -0.165833 0.256119
C  3.506337 -1.982432 1.623199
C  3.841187 1.208422 0.157906
C  3.715338 -2.324492 0.145239
C  1.729617 -0.1116 -0.274554
C  2.437237 -2.811616 2.301018
C  1.412488 -0.026692 -1.628981
C  0.666433 -0.060407 0.621576
C  0.102462 0.049611 -2.070156
C  -0.651296 0.032206 0.210112
C  -0.932671 0.076535 -1.147741
C  2.233614 3.091799 -0.168574
C  1.852898 3.473518 1.832353
C  -3.260876 -0.227905 -0.927757
C  -3.358185 -1.5393 -0.481528
C  -4.29081 0.669067 -0.696121
C  -4.490107 -1.950895 0.200839
C  -5.428901 0.25497 -0.02198
C  -5.521589 -1.051894 0.427608
H  4.447211 -2.078547 2.176457
H  4.117126 1.394392 -0.879379
H  4.748993 1.206721 0.760433
H  4.574712 -2.969694 -0.035384
H  2.824001 -2.803565 -0.281732
H  2.278659 -2.487956 3.329014
H  2.73808 -3.860351 2.328928
H  1.487205 -2.747071 1.76918
H  0.878805 -0.074754 1.680806
H  -0.118047 0.101234 -3.127493
H  -1.440679 0.085739 0.947342
H  2.254259 3.077239 -1.247977
H  1.443519 3.912733 2.728621
H  -2.557393 -2.242725 -0.6703
H  -4.20507 1.687961 -1.04947
H  -4.572639 -2.971494 0.547674
H  -6.236472 0.950972 0.157109
totalener: -2044.66662665 hartree
nucrepener: 2774.74106542 hartree
electener: -4819.40769206 hartree
oneelecener: -8319.76227843 hartree
twoeener: 3500.35458637 hartree
kineticenergy: 2038.71907337 hartree
xcener: -149.989165028670 hartree
chargesum: -0.0000000
charge: -0.063196 -0.076926 -0.342099 -0.322877 -0.296672 0.113422 -0.301659 -0.324262 0.597783 0.120461 -0.131159 0.000853 -0.167286 -0.280077 -0.004192 -0.180263 -0.187581 -0.147172 0.233759 0.043648 0.055611 0.230799 -0.168208 -0.197041 -0.111231 -0.094611 0.065048 0.068900 0.130402 0.107849 0.097709 0.071368 0.101049 0.090770 0.076315 0.149842 0.119944 0.134757 0.138715 0.128897 0.135715 0.133239 0.124505 0.125151
qa: -0.0632 -0.0769 -0.3421 -0.3229 -0.2967 0.1134 -0.3017 -0.3243 0.5978 0.1205 -0.1312 0.0009 -0.1673 -0.2801 -0.0042 -0.1803 -0.1876 -0.1472 0.2338 0.0436 0.0556 0.2308 -0.1682 -0.1970 -0.1112 -0.0946 0.0650 0.0689 0.1304 0.1078 0.0977 0.0714 0.1010 0.0908 0.0763 0.1498 0.1199 0.1348 0.1387 0.1289 0.1357 0.1332 0.1245 0.1252
va: 1.2579 1.2277 2.0282 2.0469 2.1142 3.3278 2.8687 3.0641 3.7907 3.9467 3.8798 3.9599 3.6195 3.9480 3.9807 3.9135 4.0970 3.9731 3.8804 4.0735 4.0518 3.8328 3.9864 4.0490 3.9828 3.9656 3.9415 0.9983 1.0105 1.0319 0.9954 1.0014 1.0054 1.0097 1.0051 1.0264 1.0286 1.0064 1.0059 1.0025 1.0022 1.0106 1.0107 1.0091
dispcorr: -0.025872026 hartree
energy: -2044.692498674232
dipole: 17.71706 -17.35874 0.35832 -6.86101 5.44674 -1.41427 10.95911 -11.05265 -0.09354
magnitude: 1.46195 au
magnitude: 3.71598 debye
