program: Gaussian 09
title: 000030119
version: EM64L-G09RevD.01
frameworkgroup: C1[X(C5H13N5)]
method: RPBEPBE
basis: SDD
operation: Freq
keyword: #pfreq=noraman
keyword: PBEPBE/SDD
title: #p freq=noraman PBEPBE/SDD
converged: YES YES NO NO
title: Mulliken charges:
elementType: N N N N N C C C C C H H H H H H H H H H H H H
charge: -0.283120 -0.221486 -0.653995 -0.632097 -0.650319 -0.377501 -0.399172 -0.681857 0.243337 0.245045 0.185425 0.203367 0.208326 0.179241 0.207801 0.233294 0.202309 0.326186 0.323378 0.302376 0.332648 0.426705 0.280109
chargesum: 0.00000
title: Mulliken charges with hydrogens summed into heavy atoms:
elementType: N N N N N C C C C C
charge: -0.283120 -0.221486 -0.004432 0.002926 0.056495 0.011292 -0.011605 -0.038453 0.243337 0.245045
polarizability: 1.27043284e+02 -8.63335155e+00 1.05099242e+02 4.41588227e+00 4.26280934e+00 5.81506694e+01
1716.lowfreq: -7.6491 -0.0010 -0.0009 -0.0008 6.8576 10.5455 43.3620 72.0092 105.8074
frequency: 43.0985 71.9591 105.7929 122.2587 146.6128 206.4448 214.9653 265.1588 275.9835 305.2908 341.1021 382.9153 406.3467 438.7799 474.1951 512.6847 520.7234 521.4947 675.8378 682.8695 713.5756 769.1343 850.8362 878.2324 907.3805 943.1820 1003.5764 1004.6771 1055.0149 1082.1270 1093.2583 1124.7127 1136.9105 1171.6528 1234.1638 1272.6485 1344.6468 1345.7830 1385.3656 1393.0231 1421.3403 1458.4212 1461.7988 1474.9771 1489.3387 1506.2771 1555.9389 1597.7253 1602.4627 1656.4457 2707.5225 2865.1581 2911.2996 2974.4775 2982.7798 3033.0243 3068.4832 3083.6762 3563.7437 3564.8037 3591.8015 3720.8162 3721.0494
redmass: 3.1716 3.2143 3.7119 3.1358 2.1653 1.3247 1.4837 2.2172 2.9281 1.7406 1.3265 3.0660 2.7516 1.2148 2.7996 1.1199 2.7149 1.1135 4.1591 8.4298 8.7769 1.3270 3.2260 2.4991 1.3164 2.5582 1.7596 1.1017 1.9292 1.7674 2.0124 1.8512 2.7835 1.8228 1.2241 1.1913 1.3464 1.4352 1.2354 3.0593 2.0097 1.0916 1.0831 1.0540 1.0613 3.3399 3.0092 1.4099 1.4982 2.2513 1.0825 1.0572 1.0988 1.0373 1.0603 1.1003 1.0997 1.0999 1.0441 1.0449 1.0818 1.1048 1.1052
irintensity: 0.0887 1.4160 0.7932 3.9249 1.7704 39.5376 16.9646 66.0211 13.9930 18.1016 120.3602 5.2901 5.9985 451.2445 1.2679 44.1711 6.8260 50.3656 6.4073 0.0862 11.5985 2.5666 17.0712 2.3305 5.5255 2.1600 23.9884 104.9413 6.0506 6.6587 12.8212 1.7157 50.9401 0.4031 1.0371 2.4036 76.9623 2.5561 27.1018 166.7233 164.3503 12.5907 13.4561 9.4180 8.8519 105.0501 246.3690 358.6088 253.0240 852.0117 623.1357 72.4529 58.4433 49.9331 53.2801 22.7342 63.7155 54.2406 41.1318 62.7770 15.2906 28.2768 30.9517
temp: 298.150 k
press: 1.00000 atm
elementType: 7 7 7 7 7 6 6 6 6 6 1 1 1 1 1 1 1 1 1 1 1 1 1
symmnumber: 1
zpe: 511031.4 jmol-1
zpe.correction: 0.194642 hartree
zpe.thermalcorrener: 0.206734 hartree
zpe.thermalcorrenthalpy: 0.207678 hartree
zpe.thermalcorrgfe: 0.156740 hartree
zpe.sumelectzpe: -471.301868 hartree
zpe.sumelectthermal: -471.289776 hartree
zpe.sumelectthermalent: -471.288832 hartree
zpe.sumelectthermalfe: -471.339771 hartree
dipole: 1.2525 -0.6599 -0.0760
dipole: 1.4177
quadrupole: -48.6958 -48.1155 -66.0224
quadrupole: -9.5671 0.8388 2.2235
quadrupole: 5.5821 6.1624 -11.7445 -9.5671 0.8388 2.2235
hfenergy: -471.49651 hartree
pointgroup: C01 [X(C5H13N5)]
dipole: -0.4958145 0.2474489 -0.0636834 debye
dipolederiv: -1.4358186 -0.0912063 0.0481061 -0.3801222 -0.708703 0.0856742 0.1034452 0.0617543 -0.4095405 -1.4939331 0.5670097 -0.0574724 0.8668831 -1.2598456 0.1297449 -0.0912584 0.1380484 -0.3955726 -0.3382921 0.1859523 -0.0823983 -0.0166104 -1.2978268 0.0960473 -0.0300279 0.0917737 -0.72869 -1.5225615 0.3042796 -0.0219321 0.3140041 -0.3297315 -0.1036113 -0.0176628 -0.1041752 -0.7298502 -0.7868764 -0.1805999 0.0423345 -0.0124331 -0.9515231 0.0785833 -0.0005004 0.0820726 -0.6247013 0.1362325 -0.0417254 0.0173728 -0.0343768 0.0793418 -0.0170429 -0.0012525 -0.0019888 0.1012307 0.7095229 0.0022921 -0.0116693 -0.0227456 0.1583168 0.0109708 -0.0004512 0.0055353 0.3538047 0.0391954 0.0043567 0.0075783 -0.0398895 -0.0106216 -0.0849131 0.0243191 -0.0900982 -0.0001845 1.7775926 -0.4659592 0.0182897 0.0975984 1.5913529 -0.267116 -0.1361131 -0.2402307 0.26322 1.915271 -0.1831543 -0.0760218 -0.8319376 1.6153783 -0.24264 0.039167 -0.2766679 0.3101199 -0.2252016 0.0678488 0.0620562 0.0878302 0.0104986 -0.0484424 0.0242781 -0.036813 0.0576678 0.0920237 0.0413724 -0.0769246 -0.0128161 -0.0175116 0.0930556 -0.0353623 0.0699089 -0.138962 -0.1336234 0.0033294 0.0144733 0.1021311 -0.0922582 -0.1552674 0.0933956 -0.1506579 -0.0910897 -0.1509009 0.025523 -0.0251796 0.1090164 -0.0283843 0.1137081 -0.1244989 0.1376613 -0.1378144 -0.0337716 -0.1568192 0.0073571 -0.1713459 -0.1164385 -0.0021958 0.0205865 0.023176 0.0692957 -0.0886495 0.1115563 0.0641543 0.1138961 0.0786709 -0.016465 0.0497198 0.0000336 0.0677418 0.0642539 0.0269775 -0.0693362 0.0689382 0.0167315 0.123233 -0.0751821 0.0600652 -0.1228819 0.1113254 0.0270085 0.0171265 0.0314869 0.2420815 0.0283266 0.0129294 0.0337136 0.3484797 0.1728937 -0.0113627 0.0216238 -0.0196314 0.23313 0.0313626 0.0251168 0.0351942 0.378227 0.2026772 -0.0121341 0.0180202 -0.0095803 0.1296641 0.0532371 0.0227187 0.0509218 0.3792215 0.2506434 0.0083884 0.0116729 0.0112497 0.1643614 0.0472365 0.0120965 0.047209 0.3843964 0.6104779 -0.3257137 0.0754056 -0.3371871 0.4152319 -0.0154053 0.07713 0.0014998 0.2984985 0.127519 0.0927799 -0.0046372 0.0856415 0.0780846 0.0619193 0.0074069 0.062064 0.3673832 unknown
polarizability: 127.6230725|-8.0314157|104.271757|-0.7713931|-6.7433357|58.3983653 unknown
InChI: InChI=1S/C5H13N5/c1-2-3-9-5(8)10-4(6)7/h2-3,6-8H2,1H3
charge 0 multiplicity 1
23 atoms
N  0.601546 -0.179226 -0.036894
N  -1.736567 -0.726339 0.247549
N  -0.166932 -2.409537 0.464327
N  -3.493343 0.78407 0.063449
N  -1.267122 1.563542 -0.277649
C  2.964486 0.551753 -0.216855
C  2.000302 -0.642577 -0.055007
C  2.932149 1.511663 0.99054
C  -0.378918 -1.055102 0.211141
C  -2.129185 0.537356 0.009685
H  3.993471 0.165737 -0.363496
H  2.688272 1.098788 -1.139427
H  2.171606 -1.3589 -0.89362
H  2.266285 -1.182431 0.887759
H  3.582854 2.390407 0.826121
H  1.902019 1.867347 1.169784
H  3.275629 1.001518 1.910871
H  0.762876 -2.815394 0.470754
H  -0.984397 -2.983924 0.6509
H  -3.889637 1.706027 -0.089066
H  -4.095796 -0.005976 0.276894
H  -0.249402 1.217155 -0.282237
H  -1.582597 2.512543 -0.468722
