program: Orca
programVersion: 4.2.1
elementType: Cl Cl O O O N N N C C C C C C C C C C C C C C C C C C C H H H H H H H H H H H H H H H H H
charge: 0
multiplicity: 1
keywords: wb97x-d3
keywords: def2-TZVPP
keywords: def2/J RIJCOSX GRIDX6 NOFINALGRIDX
keywords: grid4 nofinalgrid
keywords: scfconv7
keywords: smallprint printgap noloewdin
keywords: NOSOSCF
formula: C19H17Cl2N3O3
InChI: InChI=1S/C19H17Cl2N3O3/c1-13-9-25-19(27-13,10-24-12-22-11-23-24)17-7-6-16(8-18(17)21)26-15-4-2-14(20)3-5-15/h2-8,11-13H,9-10H2,1H3
44 atoms
Cl -0.047606 2.138733 -0.129166
Cl -7.427375 -0.816764 -1.847291
O  3.545479 -0.578697 0.243371
O  2.596981 1.108458 -0.900341
O  -2.49732 -2.138316 1.019335
N  4.133027 1.911169 1.417009
N  4.284978 3.131078 0.893316
N  6.282335 2.239239 1.3908
C  2.539932 0.39716 0.297459
C  4.089017 -0.627234 -1.069018
C  2.840755 1.290778 1.514232
C  3.787865 0.776716 -1.578074
C  1.165149 -0.237572 0.462387
C  3.464019 -1.72975 -1.903639
C  -0.028115 0.460716 0.285481
C  1.063717 -1.571889 0.845219
C  -1.263633 -0.146769 0.452641
C  -0.155201 -2.202396 1.011093
C  -1.324661 -1.486793 0.806328
C  5.336795 1.391284 1.703005
C  5.585998 3.286728 0.898258
C  -3.617994 -1.787572 0.322775
C  -4.800832 -1.651918 1.031648
C  -3.606497 -1.629384 -1.057137
C  -5.978702 -1.360082 0.362698
C  -4.781273 -1.325995 -1.723798
C  -5.96335 -1.191969 -1.012019
H  5.163623 -0.796208 -0.96695
H  2.80321 0.68171 2.418897
H  2.097214 2.079352 1.606203
H  4.593416 1.481164 -1.345489
H  3.598685 0.812475 -2.652176
H  2.402643 -1.550604 -2.079868
H  3.570273 -2.698545 -1.415839
H  3.960507 -1.792394 -2.873053
H  1.968281 -2.140922 1.004372
H  -2.164691 0.434548 0.310889
H  -0.203331 -3.24373 1.299217
H  5.46854 0.411804 2.134922
H  6.050889 4.192871 0.542736
H  -4.800662 -1.781509 2.105539
H  -2.687589 -1.743658 -1.617228
H  -6.902995 -1.256793 0.913369
H  -4.776014 -1.201148 -2.797501
totalener: -2044.66818904 hartree
nucrepener: 2715.72981539 hartree
electener: -4760.39800443 hartree
oneelecener: -8201.58730296 hartree
twoeener: 3441.18929853 hartree
kineticenergy: 2038.71237519 hartree
xcener: -149.989172630610 hartree
chargesum: 0.0000000
charge: -0.048497 -0.076943 -0.390476 -0.320633 -0.296313 0.100969 -0.297458 -0.326554 0.559486 0.156436 -0.143433 -0.005720 -0.109432 -0.297663 -0.020310 -0.091707 -0.165456 -0.224605 0.237061 0.025410 0.046703 0.245018 -0.212972 -0.173950 -0.088145 -0.104953 0.057573 0.083089 0.123169 0.134448 0.084883 0.083681 0.097436 0.089115 0.092501 0.133334 0.124637 0.128825 0.144875 0.130893 0.129489 0.137021 0.124204 0.124965
qa: -0.0485 -0.0769 -0.3905 -0.3206 -0.2963 0.1010 -0.2975 -0.3266 0.5595 0.1564 -0.1434 -0.0057 -0.1094 -0.2977 -0.0203 -0.0917 -0.1655 -0.2246 0.2371 0.0254 0.0467 0.2450 -0.2130 -0.1740 -0.0881 -0.1050 0.0576 0.0831 0.1232 0.1344 0.0849 0.0837 0.0974 0.0891 0.0925 0.1333 0.1246 0.1288 0.1449 0.1309 0.1295 0.1370 0.1242 0.1250
va: 1.2765 1.2278 1.9866 2.0459 2.1148 3.3564 2.8451 3.0545 3.8423 3.9069 3.8235 4.0261 3.5791 3.9616 4.0973 3.8818 3.9639 4.0721 3.8637 4.0782 4.0439 3.8175 4.0535 3.9743 3.9653 3.9826 3.9489 0.9993 1.0056 1.0350 0.9928 0.9975 0.9984 1.0095 1.0096 1.0278 1.0263 1.0151 1.0092 1.0027 1.0123 1.0013 1.0091 1.0104
dispcorr: -0.024919159 hartree
energy: -2044.693108197044
dipole: 29.07322 -29.27089 -0.19767 -9.45650 8.04951 -1.40700 -0.65173 0.50596 -0.14578
magnitude: 1.42827 au
magnitude: 3.63038 debye
