program: Orca
programVersion: 4.2.1
elementType: Cl Cl O O O N N N C C C C C C C C C C C C C C C C C C C H H H H H H H H H H H H H H H H H
charge: 0
multiplicity: 1
keywords: wb97x-d3
keywords: def2-TZVPP
keywords: def2/J RIJCOSX GRIDX6 NOFINALGRIDX
keywords: grid4 nofinalgrid
keywords: scfconv7
keywords: smallprint printgap noloewdin
keywords: NOSOSCF
formula: C19H17Cl2N3O3
InChI: InChI=1S/C19H17Cl2N3O3/c1-13-9-25-19(27-13,10-24-12-22-11-23-24)17-7-6-16(8-18(17)21)26-15-4-2-14(20)3-5-15/h2-8,11-13H,9-10H2,1H3
44 atoms
Cl 0.502091 -0.248997 2.016692
Cl -7.495469 -1.117031 1.0143
O  3.173712 -0.128852 0.81177
O  3.471717 0.586083 -1.272817
O  -2.447643 -1.391735 -1.935476
N  3.697627 2.652384 0.632767
N  4.384118 3.428033 -0.211576
N  5.540703 3.118388 1.684685
C  2.583176 0.623364 -0.202761
C  4.038066 -1.094074 0.232849
C  2.438142 2.075475 0.259858
C  4.092845 -0.677739 -1.2464
C  1.216744 0.068993 -0.604532
C  3.528819 -2.503896 0.447907
C  0.244479 -0.336492 0.30698
C  0.881659 -0.004121 -1.9547
C  -0.99018 -0.820282 -0.101371
C  -0.342668 -0.474033 -2.388759
C  -1.281298 -0.8900 -1.455939
C  4.406563 2.471588 1.757588
C  5.477772 3.685361 0.460385
C  -3.594561 -1.302835 -1.198443
C  -4.03644 -0.093057 -0.678918
C  -4.350437 -2.452571 -1.036088
C  -5.237591 -0.038426 0.00741
C  -5.557961 -2.395784 -0.358585
C  -5.99459 -1.189681 0.164297
H  5.017226 -0.978362 0.707152
H  1.749654 2.120455 1.103931
H  2.021708 2.676816 -0.546362
H  5.109208 -0.571866 -1.625634
H  3.560037 -1.398045 -1.880579
H  3.43699 -2.730773 1.509214
H  4.222164 -3.225785 0.013015
H  2.553024 -2.649783 -0.017519
H  1.603554 0.325743 -2.689144
H  -1.708485 -1.140815 0.64119
H  -0.574784 -0.520666 -3.444071
H  4.056767 1.876712 2.58626
H  6.258858 4.310322 0.05667
H  -3.452478 0.808602 -0.811918
H  -3.998692 -3.388966 -1.448042
H  -5.587468 0.901246 0.411405
H  -6.152686 -3.289927 -0.234435
totalener: -2044.66870038 hartree
nucrepener: 2715.81222217 hartree
electener: -4760.48092254 hartree
oneelecener: -8201.57473153 hartree
twoeener: 3441.09380899 hartree
kineticenergy: 2038.72196029 hartree
xcener: -149.989876424747 hartree
chargesum: -0.0000000
charge: -0.059146 -0.075285 -0.356800 -0.331369 -0.294983 0.109600 -0.298493 -0.338901 0.596490 0.173411 -0.127459 -0.043507 -0.208941 -0.283607 -0.019325 -0.086451 -0.151115 -0.232995 0.236888 0.037072 0.053098 0.237936 -0.170938 -0.210837 -0.106649 -0.088461 0.061141 0.080966 0.138532 0.120736 0.098875 0.081573 0.096483 0.092327 0.078308 0.144398 0.124158 0.130876 0.144016 0.129252 0.137691 0.130889 0.125988 0.124556
qa: -0.0591 -0.0753 -0.3568 -0.3314 -0.2950 0.1096 -0.2985 -0.3389 0.5965 0.1734 -0.1275 -0.0435 -0.2089 -0.2836 -0.0193 -0.0865 -0.1511 -0.2330 0.2369 0.0371 0.0531 0.2379 -0.1709 -0.2108 -0.1066 -0.0885 0.0611 0.0810 0.1385 0.1207 0.0989 0.0816 0.0965 0.0923 0.0783 0.1444 0.1242 0.1309 0.1440 0.1293 0.1377 0.1309 0.1260 0.1246
va: 1.2626 1.2292 2.0013 2.0379 2.1143 3.3542 2.8827 3.0599 3.8274 3.8607 3.7947 3.9691 3.6319 3.9761 4.0478 3.9007 3.9614 4.0709 3.8645 4.0796 4.0613 3.8197 3.9798 4.0545 3.9815 3.9649 3.9450 0.9999 1.0119 1.0278 0.9997 0.9938 1.0095 1.0089 1.0008 1.0228 1.0268 1.0147 1.0114 1.0014 1.0007 1.0117 1.0101 1.0094
dispcorr: -0.024618951 hartree
energy: -2044.693319327611
dipole: 26.56635 -27.24906 -0.68270 -4.39274 3.00629 -1.38645 -9.46768 8.73718 -0.73050
magnitude: 1.70938 au
magnitude: 4.34489 debye
