program: Orca
programVersion: 4.2.1
elementType: Cl Cl O O O N N N C C C C C C C C C C C C C C C C C C C H H H H H H H H H H H H H H H H H
charge: 0
multiplicity: 1
keywords: wb97x-d3
keywords: def2-TZVPP
keywords: def2/J RIJCOSX GRIDX6 NOFINALGRIDX
keywords: grid4 nofinalgrid
keywords: scfconv7
keywords: smallprint printgap noloewdin
keywords: NOSOSCF
formula: C19H17Cl2N3O3
InChI: InChI=1S/C19H17Cl2N3O3/c1-13-9-25-19(27-13,10-24-12-22-11-23-24)17-7-6-16(8-18(17)21)26-15-4-2-14(20)3-5-15/h2-8,11-13H,9-10H2,1H3
44 atoms
Cl 0.22744 1.398361 -1.611595
Cl -7.661126 -0.156604 -0.631672
O  3.553653 -0.430386 0.842749
O  2.994396 0.56783 -1.09219
O  -2.375573 -2.459855 0.37977
N  3.694408 2.366346 1.066168
N  4.002741 3.308048 0.169676
N  5.732196 2.948266 1.552537
C  2.567761 0.344175 0.216167
C  4.477523 -0.896981 -0.131833
C  2.446826 1.656067 1.01215
C  4.339759 0.164739 -1.215381
C  1.22378 -0.373587 0.214493
C  4.148366 -2.301435 -0.602974
C  0.137923 0.02864 -0.560765
C  1.029742 -1.470137 1.049893
C  -1.076159 -0.641602 -0.525098
C  -0.173479 -2.147064 1.113504
C  -1.230531 -1.732148 0.318124
C  4.741194 2.16037 1.880453
C  5.229149 3.629686 0.500297
C  -3.582377 -1.870833 0.132778
C  -3.964538 -0.691091 0.758227
C  -4.455481 -2.522646 -0.723017
C  -5.220949 -0.161793 0.517854
C  -5.717535 -1.999257 -0.95415
C  -6.093307 -0.817599 -0.337266
H  5.468059 -0.876691 0.328596
H  2.12176 1.426455 2.028257
H  1.706445 2.311826 0.559428
H  5.02612 1.003861 -1.059636
H  4.495638 -0.226227 -2.222164
H  4.923045 -2.659479 -1.28254
H  3.194443 -2.338621 -1.130664
H  4.100813 -2.994836 0.236539
H  1.846348 -1.804032 1.673634
H  -1.88548 -0.307726 -1.160225
H  -0.294867 -2.996385 1.771988
H  4.729612 1.442165 2.685015
H  5.780231 4.389063 -0.031961
H  -3.289913 -0.182912 1.434934
H  -4.150087 -3.443224 -1.201906
H  -5.521921 0.756614 1.002016
H  -6.401595 -2.50801 -1.618639
totalener: -2044.66790539 hartree
nucrepener: 2714.45670231 hartree
electener: -4759.12460770 hartree
oneelecener: -8199.06108130 hartree
twoeener: 3439.93647360 hartree
kineticenergy: 2038.71381957 hartree
xcener: -149.989226611078 hartree
chargesum: 0.0000000
charge: -0.047913 -0.076852 -0.390621 -0.321118 -0.296518 0.102195 -0.299366 -0.326904 0.560331 0.155518 -0.140509 -0.006919 -0.104949 -0.296626 -0.030740 -0.095607 -0.160190 -0.224947 0.235806 0.027628 0.047846 0.244018 -0.175991 -0.212485 -0.105857 -0.088266 0.059403 0.083385 0.121515 0.133468 0.085517 0.083838 0.092207 0.099593 0.088859 0.135161 0.124974 0.128947 0.143343 0.130405 0.137532 0.130412 0.126063 0.124416
qa: -0.0479 -0.0769 -0.3906 -0.3211 -0.2965 0.1022 -0.2994 -0.3269 0.5603 0.1555 -0.1405 -0.0069 -0.1049 -0.2966 -0.0307 -0.0956 -0.1602 -0.2249 0.2358 0.0276 0.0478 0.2440 -0.1760 -0.2125 -0.1059 -0.0883 0.0594 0.0834 0.1215 0.1335 0.0855 0.0838 0.0922 0.0996 0.0889 0.1352 0.1250 0.1289 0.1433 0.1304 0.1375 0.1304 0.1261 0.1244
va: 1.2774 1.2277 1.9878 2.0455 2.1156 3.3587 2.8458 3.0544 3.8436 3.9076 3.8259 4.0276 3.5748 3.9613 4.1135 3.8870 3.9602 4.0746 3.8687 4.0785 4.0435 3.8177 3.9768 4.0544 3.9828 3.9650 3.9473 0.9996 1.0058 1.0342 0.9927 0.9972 1.0096 0.9979 1.0089 1.0272 1.0260 1.0152 1.0095 1.0027 1.0008 1.0119 1.0101 1.0092
dispcorr: -0.024922833 hartree
energy: -2044.692828227681
dipole: 30.63549 -30.73512 -0.09963 -10.19497 8.72725 -1.46772 5.05975 -4.80082 0.25893
magnitude: 1.49371 au
magnitude: 3.79672 debye
