program: Gaussian 09
title: 000030167
version: EM64L-G09RevD.01
frameworkgroup: C1[X(C16H22N2)]
method: RPBEPBE
basis: SDD
operation: Freq
keyword: #pfreq=noraman
keyword: PBEPBE/SDD
title: #p freq=noraman PBEPBE/SDD
converged: YES YES NO NO
title: Mulliken charges:
elementType: N N C C C C C C C C C C C C C C C C H H H H H H H H H H H H H H H H H H H H H H
charge: -0.142691 -0.415969 -0.155477 -0.473137 -0.361870 -0.464319 0.358287 -0.354693 -0.379569 0.092216 -0.415862 0.240944 -0.345235 -0.416436 -0.358601 -0.694870 -0.256900 -0.220757 0.202229 0.209450 0.235118 0.224251 0.169613 0.221391 0.212825 0.173186 0.221416 0.198332 0.199531 0.284730 0.194113 0.192188 0.300550 0.229986 0.224669 0.208846 0.215696 0.210150 0.217686 0.218981
chargesum: 0.00000
title: Mulliken charges with hydrogens summed into heavy atoms:
elementType: N N C C C C C C C C C C C C C C C C
charge: -0.142691 -0.115419 0.046752 -0.028568 0.031995 -0.030104 0.358287 0.039909 0.018295 0.092216 -0.131132 0.240944 0.041066 -0.186450 -0.133933 -0.060177 -0.039214 -0.001775
polarizability: 2.34323788e+02 -1.65581764e+01 1.62283729e+02 -2.15295649e+01 -1.81243312e+01 1.54896148e+02
1716.lowfreq: -19.4873 0.0003 0.0003 0.0005 1.7221 7.2801 16.0157 28.4094 33.0922
frequency: -16.5190 27.7409 32.7357 61.0211 86.4561 97.4637 112.3383 134.1569 179.3012 194.4169 222.8809 229.0946 232.9676 273.6586 298.3797 342.3561 401.3991 422.2553 433.3456 484.7649 507.5369 550.7428 577.3145 583.6475 605.7292 627.6315 659.1988 704.9707 734.6104 746.8815 763.0452 766.4957 793.2658 822.2530 829.4911 848.1849 861.0414 866.8191 888.5612 899.0376 928.0700 930.7812 936.3463 963.1502 967.9079 1010.3628 1020.6609 1039.3828 1063.1968 1074.5429 1079.6890 1085.9124 1089.4559 1115.1505 1126.9850 1142.5795 1162.9555 1166.4314 1185.7897 1193.0772 1225.0423 1227.6088 1234.6776 1244.3337 1263.8462 1280.5461 1283.8495 1286.3714 1287.6256 1292.7876 1302.7830 1311.3636 1339.5115 1346.1076 1359.0853 1377.2882 1387.8361 1398.2036 1421.4104 1460.0206 1462.3336 1464.0678 1468.7101 1474.9235 1477.0049 1478.1892 1480.7934 1485.7361 1490.0360 1561.9440 1585.2590 1630.4565 2818.9509 2827.9166 2841.9119 2963.6341 2971.4388 2973.7518 3002.5879 3007.9086 3011.0000 3015.3701 3038.3555 3042.8373 3068.6511 3070.6366 3070.7750 3089.2006 3120.4664 3128.0454 3142.1576 3160.3439 3237.8941 3613.3934
redmass: 2.5707 4.3880 2.8939 1.7232 3.1427 3.3136 2.9912 3.2299 3.3413 1.9575 3.9741 2.3502 1.3320 3.1650 3.5166 3.2466 4.0465 2.8627 3.3455 3.3535 1.2894 5.3021 2.9796 2.1992 5.2910 3.7757 3.6205 2.9781 1.0789 1.3562 4.6506 3.3018 1.1865 2.4048 1.3953 1.4834 2.3319 4.4432 2.0401 1.7613 1.4100 2.1923 1.2861 2.2085 1.3081 2.1081 2.9109 3.2616 2.4818 2.0270 1.5324 2.2290 2.1819 2.0129 1.4363 1.4223 1.5273 1.1843 2.7847 1.7377 1.4269 1.3966 2.1135 1.5558 1.2316 1.2728 1.1483 1.7382 1.4222 1.3227 1.5839 1.4180 1.5003 1.5302 1.7280 1.5723 1.2695 3.6541 2.1806 4.1165 1.0959 1.0954 1.0722 1.0823 1.0427 1.0762 2.9500 1.0961 1.0980 6.5546 6.2694 6.9467 1.0721 1.0763 1.0747 1.0581 1.0394 1.0571 1.0941 1.0608 1.0917 1.0654 1.0942 1.0953 1.1008 1.1002 1.1008 1.1048 1.0845 1.0888 1.0952 1.1001 1.0981 1.0807
irintensity: 0.3358 0.4226 0.0299 0.2708 1.1808 0.3827 0.9215 0.8647 0.3798 0.7278 7.8188 0.6280 0.1756 0.8889 0.6953 3.2745 2.5050 10.1220 5.2583 8.6579 81.9456 2.1172 8.4998 2.0967 6.0785 4.4844 0.4497 1.3800 8.0805 103.2687 3.1203 11.2743 0.1215 0.9125 21.2763 0.4564 11.7899 0.4506 12.2535 10.9359 1.3148 7.3141 3.3768 1.1313 0.1137 12.5301 4.1008 16.9126 6.5959 1.7271 35.3075 4.4984 32.0575 2.3026 1.1364 9.8839 8.9680 1.1923 24.7638 25.0165 8.8573 0.0646 20.4796 9.0229 1.0688 0.2413 3.3583 6.9783 1.1682 13.5945 14.8566 2.5958 2.5931 1.0672 7.4430 32.1780 1.3248 41.1956 7.5854 25.3704 4.2524 2.3955 0.4013 9.1032 12.3611 0.6817 0.6502 3.7770 11.8413 5.3693 0.4523 1.1230 47.1446 55.7294 176.4272 13.4810 29.2646 61.3890 7.7444 26.0530 12.1940 42.7654 29.3805 71.1147 90.0345 58.1161 10.1776 55.4589 2.2042 5.0161 41.3164 32.9454 0.0523 52.1686
temp: 298.150 k
press: 1.00000 atm
elementType: 7 7 6 6 6 6 6 6 6 6 6 6 6 6 6 6 6 6 1 1 1 1 1 1 1 1 1 1 1 1 1 1 1 1 1 1 1 1 1 1
symmnumber: 1
zpe: 907921.4 jmol-1
zpe.correction: 0.345809 hartree
zpe.thermalcorrener: 0.362233 hartree
zpe.thermalcorrenthalpy: 0.363177 hartree
zpe.thermalcorrgfe: 0.300657 hartree
zpe.sumelectzpe: -731.052619 hartree
zpe.sumelectthermal: -731.036195 hartree
zpe.sumelectthermalent: -731.035251 hartree
zpe.sumelectthermalfe: -731.097771 hartree
dipole: -0.9167 -0.5020 1.0670
dipole: 1.4936
quadrupole: -108.2044 -104.0276 -102.8722
quadrupole: -4.8864 2.6850 -8.5903
quadrupole: -3.1696 1.0071 2.1625 -4.8864 2.6850 -8.5903
hfenergy: -731.398428 hartree
pointgroup: C01 [X(C16H22N2)]
dipole: 0.3247313 -0.0437502 -0.4877843 debye
polarizability: 235.7660077|17.1414255|144.3678792|-16.4401163|14.9219451|171.3697783 unknown
InChI: InChI=1S/C16H22N2/c1-2-3-10-18-11-6-9-16(18)14-12-17-15-8-5-4-7-13(14)15/h4-5,7-8,12,16-17H,2-3,6,9-11H2,1H3
charge 0 multiplicity 1
40 atoms
N  1.815124 0.685839 0.162665
N  -1.798464 -0.431773 -1.907505
C  0.463527 0.890524 0.77855
C  0.363107 2.442676 1.019584
C  2.667519 1.82561 0.580532
C  1.702965 3.023793 0.485842
C  -0.635468 0.319951 -0.087424
C  2.37825 -0.659937 0.402075
C  3.630477 -0.954106 -0.44808
C  -1.9879 -0.010641 0.330054
C  -0.559847 0.051772 -1.452682
C  -2.696638 -0.481312 -0.834724
C  4.1442 -2.40003 -0.259742
C  -2.673918 0.044169 1.57327
C  -4.047172 -0.891646 -0.784449
C  5.408242 -2.698355 -1.094568
C  -4.020731 -0.36467 1.629914
C  -4.700373 -0.827471 0.463703
H  0.414999 0.383933 1.776777
H  0.252508 2.648799 2.099712
H  -0.512968 2.870915 0.505743
H  3.544153 1.928134 -0.082871
H  3.044259 1.706764 1.630594
H  1.597378 3.328077 -0.570453
H  2.051998 3.896275 1.065321
H  2.626756 -0.806535 1.487833
H  1.59257 -1.398718 0.151406
H  4.44351 -0.246769 -0.187604
H  3.383947 -0.777268 -1.514104
H  0.295083 0.172331 -2.11364
H  3.340076 -3.112373 -0.53593
H  4.359921 -2.57594 0.814167
H  -2.003801 -0.716086 -2.862272
H  -2.165386 0.401628 2.476096
H  -4.574885 -1.246649 -1.677139
H  6.236382 -2.01961 -0.81554
H  5.757266 -3.736639 -0.944607
H  5.211851 -2.559773 -2.174528
H  -4.561072 -0.328191 2.582599
H  -5.748745 -1.137496 0.539724
