program: Orca
programVersion: 4.2.1
elementType: Cl Cl O O O N N N C C C C C C C C C C C C C C C C C C C H H H H H H H H H H H H H H H H H
charge: 0
multiplicity: 1
keywords: wb97x-d3
keywords: def2-TZVPP
keywords: def2/J RIJCOSX GRIDX6 NOFINALGRIDX
keywords: grid4 nofinalgrid
keywords: scfconv7
keywords: smallprint printgap noloewdin
keywords: NOSOSCF
formula: C19H17Cl2N3O3
InChI: InChI=1S/C19H17Cl2N3O3/c1-13-9-25-19(27-13,10-24-12-22-11-23-24)17-7-6-16(8-18(17)21)26-15-4-2-14(20)3-5-15/h2-8,11-13H,9-10H2,1H3
44 atoms
Cl 1.249205 -1.547561 2.130213
Cl -6.578609 1.064383 0.914367
O  3.919488 -0.977799 1.00269
O  4.134756 0.309761 -0.789891
O  -1.902321 -1.206751 -1.785732
N  2.004046 2.082491 0.689445
N  2.154841 2.874374 -0.376007
N  0.008508 2.83864 0.274929
C  3.261409 -0.007927 0.249012
C  4.738495 -1.741575 0.131258
C  3.064384 1.229191 1.14857
C  4.764442 -0.897044 -1.157063
C  1.916117 -0.480754 -0.299897
C  4.199278 -3.142126 -0.074836
C  0.94948 -1.11538 0.478476
C  1.555325 -0.131384 -1.597369
C  -0.321453 -1.373923 -0.00433
C  0.291537 -0.379636 -2.103438
C  -0.651582 -0.987317 -1.295056
C  0.714607 2.062948 1.057109
C  0.938016 3.311449 -0.585034
C  -2.958529 -0.648463 -1.119658
C  -2.869076 0.579345 -0.474613
C  -4.158933 -1.343072 -1.14439
C  -3.988591 1.102597 0.152641
C  -5.277275 -0.812364 -0.523723
C  -5.186366 0.406854 0.128519
H  5.731666 -1.793728 0.586946
H  3.992956 1.796798 1.190953
H  2.8178 0.89537 2.155268
H  5.772509 -0.669973 -1.504405
H  4.225182 -1.400204 -1.969732
H  4.861158 -3.706626 -0.733964
H  3.207564 -3.124554 -0.528318
H  4.132708 -3.680723 0.869517
H  2.271442 0.392459 -2.214195
H  -1.056233 -1.853677 0.628698
H  0.029304 -0.07634 -3.107837
H  0.346689 1.482191 1.889586
H  0.710237 4.00162 -1.3820
H  -1.946585 1.148201 -0.456096
H  -4.217199 -2.296461 -1.652524
H  -3.92033 2.05879 0.652637
H  -6.213604 -1.352448 -0.541262
totalener: -2044.66602569 hartree
nucrepener: 2850.83695060 hartree
electener: -4895.50297630 hartree
oneelecener: -8472.07851780 hartree
twoeener: 3576.57554150 hartree
kineticenergy: 2038.72265981 hartree
xcener: -149.991277434003 hartree
chargesum: -0.0000000
charge: -0.057152 -0.085476 -0.334099 -0.329258 -0.303770 0.122794 -0.300275 -0.357140 0.617489 0.162195 -0.133506 -0.051262 -0.175570 -0.289645 -0.065981 -0.116793 -0.097494 -0.191058 0.189172 0.050129 0.067551 0.171577 -0.095421 -0.173298 -0.190770 -0.117187 0.100214 0.077237 0.109591 0.135889 0.097454 0.082491 0.091773 0.083190 0.097033 0.145914 0.123818 0.128989 0.146203 0.129865 0.155066 0.128748 0.129903 0.120871
qa: -0.0572 -0.0855 -0.3341 -0.3293 -0.3038 0.1228 -0.3003 -0.3571 0.6175 0.1622 -0.1335 -0.0513 -0.1756 -0.2896 -0.0660 -0.1168 -0.0975 -0.1911 0.1892 0.0501 0.0676 0.1716 -0.0954 -0.1733 -0.1908 -0.1172 0.1002 0.0772 0.1096 0.1359 0.0975 0.0825 0.0918 0.0832 0.0970 0.1459 0.1238 0.1290 0.1462 0.1299 0.1551 0.1287 0.1299 0.1209
va: 1.2650 1.2191 2.0483 2.0369 2.0970 3.3215 2.8689 3.0065 3.7650 3.8972 3.8415 3.9726 3.6021 3.9622 3.9790 3.8424 3.9959 4.0671 3.9109 4.0263 4.0298 3.8378 3.8406 4.0047 4.0738 4.0118 3.8864 0.9977 1.0367 1.0078 0.9982 0.9933 1.0099 0.9996 1.0094 1.0284 1.0229 1.0120 1.0062 1.0022 1.0174 1.0121 1.0136 1.0105
dispcorr: -0.028392932 hartree
energy: -2044.694418626639
dipole: 26.71173 -25.29443 1.41730 -7.05422 5.92352 -1.13070 -9.85707 9.58371 -0.27336
magnitude: 1.83356 au
magnitude: 4.66055 debye
